program: Gaussian 09
title: 000171322
version: EM64L-G09RevD.01
frameworkgroup: C1[X(C15H23NO3)]
method: RPBEPBE
basis: SDD
operation: Freq
keyword: #p
keyword: freq=noraman
keyword: PBEPBE/SDD
title: #p freq=noraman PBEPBE/SDD
converged: YES YES NO NO
title: Mulliken charges:
elementType: O O O N C C C C C C C C C C C C C C C H H H H H H H H H H H H H H H H H H H H H H H
charge: -0.296698 -0.451207 -0.443414 -0.337949 -0.082193 -0.455329 -0.032237 -0.253237 -0.720690 -0.656572 0.239268 0.380937 -0.603792 -0.319057 -0.542405 0.298654 -0.413065 -0.039485 -0.597471 0.182177 0.256255 0.189679 0.190352 0.253942 0.227429 0.213626 0.222896 0.220519 0.207129 0.232268 0.213133 0.198976 0.333619 0.213711 0.205329 0.245676 0.257198 0.215529 0.276043 0.349853 0.211748 0.208857
chargesum: 0.00000
title: Mulliken charges with hydrogens summed into heavy atoms:
elementType: O O O N C C C C C C C C C C C C C C C
charge: -0.296698 -0.117587 -0.093561 -0.084008 0.099984 -0.009395 0.158115 0.187818 -0.070145 -0.012196 0.239268 0.380937 -0.184752 -0.073380 -0.285208 0.298654 -0.197537 0.236558 -0.176866
polarizability: 2.08806144e+02 1.41014115e+01 1.86059088e+02 1.34189547e+01 -1.84735455e+01 1.56317412e+02
1716.lowfreq: -6.9344 -0.0005 -0.0004 -0.0001 4.0377 7.7456 16.5891 17.4550 28.9444
frequency: 16.5618 17.2740 28.8698 45.3809 58.7197 73.3026 99.5338 101.4000 121.4478 149.3270 156.1465 181.5742 196.3366 219.4038 232.4380 246.8277 250.9882 282.9822 289.3283 312.5471 324.6358 337.9323 365.6151 378.3270 381.8435 422.5743 438.7975 453.4844 461.7511 487.8897 503.5462 560.5185 578.5682 598.8309 633.9714 662.5442 713.2162 756.0661 776.3160 783.3317 812.2087 838.2076 873.8616 887.6234 893.3351 917.7192 920.6060 927.5277 928.2331 940.6223 947.4994 952.2409 965.5284 1031.8000 1032.8139 1069.4688 1084.3221 1085.9960 1101.0833 1120.1309 1137.6315 1146.9078 1158.1906 1173.5249 1182.0946 1196.6646 1207.7201 1212.8876 1228.4867 1257.8921 1261.7118 1272.7766 1289.4328 1290.7021 1298.9068 1321.5389 1335.6343 1363.2587 1374.9896 1380.4027 1392.4557 1393.5630 1405.5204 1424.3460 1445.9249 1448.9068 1451.8299 1456.0228 1457.8127 1466.3867 1474.0578 1478.9996 1486.6452 1490.7985 1598.2526 1628.1243 1655.6381 2848.5020 2866.7550 2927.3135 2966.1515 2972.0918 2976.5816 2980.8175 3041.3312 3046.6316 3064.0520 3076.1308 3078.3342 3080.6201 3084.4346 3089.5818 3115.2583 3117.4077 3155.6710 3164.6840 3188.9676 3448.0869 3551.3017 3585.8128
redmass: 4.1260 4.7148 2.8673 3.7300 4.2490 3.8896 3.4260 2.8587 4.2998 2.7582 5.0561 4.9174 1.1121 1.9446 1.0900 1.2280 3.0478 2.8310 3.1211 2.9936 1.1236 4.2598 4.0747 2.6505 2.7864 2.1716 2.9466 3.0362 3.6935 3.1541 2.8194 2.5426 2.4776 2.7552 1.7110 2.9348 4.2206 3.3020 3.8010 1.5884 2.5561 2.9127 1.5416 1.4304 1.8125 1.4554 1.8028 1.9721 1.7400 1.6013 1.8393 1.9779 2.5565 1.3797 1.7709 2.2311 2.0083 2.1884 2.1932 1.6972 2.1943 1.3731 1.7670 1.6030 1.9984 1.5375 1.5293 1.5193 1.2889 2.1641 1.1847 1.6037 1.3043 1.1681 1.4137 1.3481 1.3885 1.3692 1.2742 1.4149 1.2454 2.6608 2.2093 1.1947 1.1713 1.1724 1.1604 2.0883 1.2664 1.0470 1.0916 1.1221 1.0972 2.1499 7.5086 6.6275 4.6375 1.0726 1.0822 1.0818 1.0629 1.0363 1.0566 1.0357 1.1073 1.0966 1.0991 1.0924 1.0951 1.0604 1.0988 1.0990 1.0953 1.0897 1.0920 1.0933 1.1138 1.0747 1.0658 1.0660
irintensity: 0.0775 0.2414 0.3911 0.2064 0.7994 1.5902 0.6543 1.7046 1.8248 2.5167 2.5092 7.9135 1.7095 29.3536 3.7358 120.9595 0.6397 2.0170 1.2919 9.8590 139.4037 12.7488 1.7822 0.0923 8.0118 11.8851 9.2132 5.2242 7.7749 1.5376 8.8581 0.2573 16.9046 21.1934 53.2973 4.6947 11.3563 32.9702 12.0233 55.7666 10.2950 14.4504 14.2205 2.9754 14.9970 8.1460 14.9607 28.6272 22.8081 58.4779 43.8564 9.9664 19.9758 5.3404 11.0637 72.0140 62.1789 16.3705 7.3642 1.4717 13.2267 181.8412 39.5161 63.6550 53.9435 36.9221 76.2075 116.0050 7.5405 28.4041 15.0765 3.9123 11.0526 19.0363 2.8221 3.3705 22.9295 6.2007 8.6630 30.0539 26.2106 12.0282 9.6967 6.8408 89.9406 12.6256 7.1396 2.3004 4.1480 1.0163 6.5958 37.2375 26.8952 148.3446 12.1346 12.2644 18.1967 106.3968 110.7426 59.7287 29.4580 37.6454 57.6889 14.3799 25.8068 22.4984 35.8453 19.7273 18.3517 13.0646 29.2869 57.5984 4.5070 22.8537 7.5297 8.7935 27.5941 1.0304 3.8740 34.7690
temp: 298.150 k
press: 1.00000 atm
elementType: 8 8 8 7 6 6 6 6 6 6 6 6 6 6 6 6 6 6 6 1 1 1 1 1 1 1 1 1 1 1 1 1 1 1 1 1 1 1 1 1 1 1
symmnumber: 1
zpe: 925336.2 jmol-1
zpe.correction: 0.352442 hartree
zpe.thermalcorrener: 0.374023 hartree
zpe.thermalcorrenthalpy: 0.374967 hartree
zpe.thermalcorrgfe: 0.299743 hartree
zpe.sumelectzpe: -864.280844 hartree
zpe.sumelectthermal: -864.259263 hartree
zpe.sumelectthermalent: -864.258318 hartree
zpe.sumelectthermalfe: -864.333542 hartree
dipole: 4.1974 -1.6228 1.3974
dipole: 4.7121
quadrupole: -103.8240 -111.5693 -111.1767
quadrupole: 9.8379 -2.5236 -6.9708
quadrupole: 5.0327 -2.7126 -2.3200 9.8379 -2.5236 -6.9708
hfenergy: -864.6332858 hartree
pointgroup: C01 [X(C15H23N1O3)]
dipole: 1.654728 -0.7437919 0.3814725 debye
polarizability: 211.3087821|11.0161244|188.2332306|10.2158931|-16.7933448|151.6406312 unknown
InChI: InChI=1S/C15H23NO3/c1-4-5-12-8-13(17)6-7-15(12)19-10-14(18)9-16-11(2)3/h4,6-8,11,14,16-18H,1,5,9-10H2,2-3H3
charge 0 multiplicity 1
42 atoms
O  0.176543 0.292133 0.475504
O  1.873016 2.16028 1.863123
O  -5.032928 -1.78732 -0.008256
N  3.603371 -0.558442 -0.127194
C  2.308453 0.798211 1.509354
C  3.007092 0.76538 0.128544
C  3.68321 -1.000851 -1.5485
C  1.070011 -0.091795 1.573475
C  4.710573 -2.146345 -1.653335
C  2.29515 -1.457627 -2.049657
C  -1.106202 -0.284541 0.435128
C  -1.980519 0.253153 -0.557287
C  -1.509993 1.39185 -1.456964
C  -1.534753 -1.327023 1.285935
C  -3.278873 -0.279438 -0.668571
C  -3.713179 -1.322728 0.182719
C  -2.844146 -1.848773 1.161132
C  -1.33581 2.70249 -0.700213
C  -1.980067 3.85464 -1.010426
H  3.021351 0.419032 2.277994
H  2.250782 0.982333 -0.643325
H  3.757517 1.596383 0.093128
H  4.032343 -0.1634 -2.202884
H  4.501939 -0.679978 0.357376
H  0.558746 0.055903 2.545305
H  1.384306 -1.147936 1.458191
H  4.417056 -2.981186 -0.990029
H  4.762752 -2.528115 -2.687912
H  5.725208 -1.809971 -1.36417
H  1.527388 -0.679902 -1.888967
H  1.975496 -2.360312 -1.498239
H  2.329251 -1.691579 -3.130081
H  2.602787 2.796656 1.651336
H  -0.531436 1.113115 -1.899843
H  -2.224681 1.531596 -2.288305
H  -0.86613 -1.746011 2.043127
H  -3.97632 0.11447 -1.414541
H  -3.173054 -2.658181 1.825667
H  -0.63173 2.667564 0.14287
H  -5.245081 -2.504552 0.638743
H  -1.818271 4.77324 -0.434458
H  -2.690968 3.914279 -1.844993
