program: Gaussian 09
title: 000171233
version: EM64L-G09RevD.01
frameworkgroup: C1[X(C9H14O3)]
method: RPBEPBE
basis: SDD
operation: Freq
keyword: #pfreq=noraman
keyword: PBEPBE/SDD
title: #p freq=noraman PBEPBE/SDD
converged: YES YES NO NO
title: Mulliken charges:
elementType: O O O C C C C C C C C C H H H H H H H H H H H H H H
charge: -0.465449 -0.439842 -0.202499 -0.013048 -0.442810 -0.568759 -0.068004 0.379836 -0.722203 -0.400791 -0.353346 -0.162715 0.221651 0.214662 0.194822 0.218120 0.213124 0.258381 0.223159 0.196077 0.241517 0.350323 0.264089 0.282604 0.319335 0.261763
chargesum: 0.00000
title: Mulliken charges with hydrogens summed into heavy atoms:
elementType: O O O C C C C C C C C C
charge: -0.115126 -0.120507 -0.202499 0.208604 -0.033327 -0.137515 0.190378 0.379836 -0.061449 -0.136702 -0.070742 0.099048
polarizability: 1.30113231e+02 3.35365758e+00 9.96885157e+01 -1.14199768e+01 1.67486660e+00 7.89922242e+01
1716.lowfreq: -15.6252 -3.6045 0.0004 0.0005 0.0007 7.7768 27.7286 36.1423 59.9787
frequency: 27.7224 35.9539 59.8718 75.5393 100.5561 160.5009 226.2670 240.4915 285.5578 309.7475 322.5189 338.7847 359.2669 422.6896 431.5660 470.4521 528.9663 588.7015 632.0462 704.4256 723.1838 774.4113 801.6165 826.2976 848.5590 859.4653 873.1413 910.8799 959.5368 978.6091 987.6312 1011.5399 1034.2228 1039.7085 1049.6043 1083.1377 1134.1915 1139.7261 1159.0946 1186.8903 1224.6244 1241.8384 1244.2874 1259.6807 1291.5763 1304.2886 1338.6508 1354.5614 1378.2742 1382.1425 1384.7386 1392.2904 1430.1486 1452.2313 1466.1978 1472.1412 1475.6575 1578.2976 2966.0648 2966.7936 2971.5974 2989.8339 3037.8808 3051.2162 3053.9252 3079.4784 3090.3174 3215.1494 3253.6359 3268.8954 3532.7745 3534.7613
redmass: 4.0218 4.3790 4.4578 4.2909 3.6358 4.0830 1.1228 3.7135 4.4296 1.0599 2.4820 1.8060 1.3391 3.1531 3.0355 1.8757 3.2830 3.9932 3.0426 2.6863 1.3909 1.4494 3.6565 2.9727 5.6018 1.3782 1.6542 1.9747 2.7304 2.1600 2.9559 2.6215 2.8829 1.7600 2.0533 1.7877 1.9719 1.9324 1.5687 1.3037 1.4201 1.2958 1.2616 1.4859 1.3661 1.3181 1.3073 1.3894 1.2757 1.2616 2.5849 1.6903 1.0954 1.1047 1.0516 1.0495 4.4679 5.9778 1.0444 1.0809 1.0583 1.0603 1.0978 1.0921 1.1011 1.0923 1.0992 1.0937 1.0989 1.1075 1.0655 1.0658
irintensity: 1.1494 0.4773 0.9789 0.7500 2.3986 3.0086 3.8235 1.4381 6.6193 152.8690 10.1161 32.3082 95.9300 46.9208 30.1528 2.4215 3.2056 10.8772 9.9121 7.0136 22.4661 74.3682 18.9454 12.1659 26.1682 1.4707 3.2225 4.3348 3.1807 8.2802 25.0959 8.5342 47.6969 86.5522 21.3179 10.1843 13.0410 43.5034 37.3800 9.6835 0.0215 5.0358 25.0169 5.1964 12.3509 0.6530 9.8136 6.1914 12.7725 26.9837 10.3179 25.1352 4.4272 10.7493 9.3161 12.0549 9.2610 2.1820 17.2008 14.4002 29.8826 41.4875 10.7583 14.3610 24.5164 46.8143 31.0627 0.8108 0.5824 0.4208 2.9868 3.0138
temp: 298.150 k
press: 1.00000 atm
elementType: 8 8 8 6 6 6 6 6 6 6 6 6 1 1 1 1 1 1 1 1 1 1 1 1 1 1
symmnumber: 1
zpe: 564559.8 jmol-1
zpe.correction: 0.215029 hartree
zpe.thermalcorrener: 0.228088 hartree
zpe.thermalcorrenthalpy: 0.229032 hartree
zpe.thermalcorrgfe: 0.174024 hartree
zpe.sumelectzpe: -576.043841 hartree
zpe.sumelectthermal: -576.030783 hartree
zpe.sumelectthermalent: -576.029839 hartree
zpe.sumelectthermalfe: -576.084847 hartree
dipole: -0.3104 0.6218 2.5503
dipole: 2.6433
quadrupole: -72.3047 -70.0487 -73.8726
quadrupole: 4.5023 -7.8710 2.0776
quadrupole: -0.2293 2.0266 -1.7973 4.5023 -7.8710 2.0776
hfenergy: -576.2588708 hartree
pointgroup: C01 [X(C9H14O3)]
dipole: 0.0737584 -0.0591345 1.0356377 debye
dipolederiv: -0.465095 0.145044 0.0399872 0.1819471 -0.443206 0.0952428 0.0967952 0.0774047 -0.7519118 -0.7234417 0.0428948 0.1248136 0.0792828 -0.7956173 -0.0098698 0.1738215 0.0119985 -0.1294635 -0.657598 0.0959104 -0.2227968 0.0510132 -0.3338453 0.1039158 -0.2988775 0.0844208 -0.2575444 0.4135962 -0.0815549 0.0166888 -0.0903301 0.3239538 -0.1013833 -0.101571 -0.1183747 0.5231457 -0.2258964 0.0442918 0.0033463 0.0144621 0.0281425 -0.0374406 0.1602594 -0.0904463 0.0625873 -0.1420274 0.0098266 0.0689707 0.0490001 0.1258936 0.0002984 0.1013245 -0.0030094 0.059693 0.5135034 -0.0381819 -0.0471386 -0.1022506 0.6526797 -0.0331099 -0.1504912 -0.0203676 0.2065173 0.1182543 0.0683097 0.0870295 0.1826347 0.0300905 0.0086229 0.1791374 -0.0104885 -0.080826 -0.2148115 -0.0924758 -0.0236005 -0.0113029 -0.0555508 -0.0151118 0.0107811 -0.0437607 0.1012301 -0.2119495 0.0392675 -0.0044892 0.0021923 0.0006538 -0.0554456 0.0069205 -0.0249721 -0.1922464 0.2852456 -0.0420551 0.2172997 -0.0214956 -0.0025926 -0.0294252 0.2501688 -0.008252 -0.0856483 0.1038663 -0.1142632 0.1712847 -0.1172022 0.1784944 -0.1431806 0.1510068 -0.1316535 -0.0157485 0.0755703 -0.036597 0.0112181 -0.038443 -0.1562185 0.0050278 -0.005958 -0.0088404 -0.0291782 0.0540688 0.0135902 0.0005251 -0.0296837 -0.1464238 -0.025616 0.0124742 0.0050443 0.0906746 0.0456857 0.0207124 -0.0184211 0.0207103 0.0557037 0.0955011 -0.0194307 0.0530688 -0.1484723 0.0225538 -0.0178901 -0.0154271 -0.0277584 -0.1179272 -0.0835315 -0.017311 -0.0134516 0.0691849 0.0360203 -0.0007188 -0.0337777 0.0148215 0.0305382 0.1128822 -0.0636412 0.0680903 -0.0977265 0.0930687 -0.0013359 -0.0346104 -0.0168795 0.0166033 0.0009201 -0.0105125 0.0216012 -0.0800437 0.0963432 -0.0028053 -0.0101764 -0.0414525 -0.1520624 0.0417317 -0.0060862 0.0469093 0.0897721 0.0664694 -0.0232767 0.0068357 0.0024751 0.0750034 0.0597356 -0.0778182 0.0316801 -0.1741382 -0.1102972 0.0606036 0.0706026 0.0989103 0.0565071 -0.058384 0.0946694 -0.0547908 0.0349264 0.1540851 -0.0570648 -0.1531708 -0.1142881 0.2383568 0.0202361 -0.1838094 -0.0033837 0.3132616 0.1330422 0.0524912 -0.0501729 0.0300088 0.0113164 0.0529422 -0.0457655 0.0617127 0.1467679 0.120353 -0.0125795 -0.0525494 -0.0336231 0.0248947 0.0232362 -0.0527673 0.0241842 0.1846216 0.3589892 -0.0043103 -0.0858494 -0.0374127 0.2856547 -0.0404034 -0.1242219 0.0449924 -0.0218028 0.0604014 -0.0678328 -0.0664215 -0.0453362 0.0689574 0.0126086 -0.0790973 0.0006839 0.1823679 unknown
polarizability: 129.1120071|5.3592486|98.3206021|12.8418595|-5.1072746|81.3613618 unknown
InChI: InChI=1S/C9H14O3/c1-7(10)4-9(11)5-8-2-3-12-6-8/h2-3,6-7,9-11H,4-5H2,1H3
charge 0 multiplicity 1
26 atoms
O  0.625241 0.856384 -1.212419
O  3.232006 -1.624682 -0.055645
O  -3.781989 0.36024 -0.698757
C  0.735904 0.110602 0.056837
C  2.109969 0.484689 0.627136
C  -0.432963 0.481308 1.012871
C  3.263042 -0.144944 -0.18437
C  -1.782595 0.162113 0.416725
C  4.642012 0.40982 0.206578
C  -2.429433 -1.142352 0.362741
C  -2.633139 1.037883 -0.243047
C  -3.626145 -0.982674 -0.310231
H  0.7116 -0.982078 -0.145131
H  2.200417 1.58825 0.607928
H  2.18224 0.158339 1.685491
H  -0.361906 1.561311 1.242686
H  -0.29783 -0.070928 1.963029
H  3.069727 0.019201 -1.257603
H  4.709551 1.49091 -0.013717
H  4.835186 0.274062 1.289985
H  5.437296 -0.109482 -0.355951
H  -0.24982 0.638265 -1.626994
H  -2.045871 -2.07183 0.781067
H  -2.606419 2.105056 -0.444527
H  3.518475 -1.856527 0.865871
H  -4.437156 -1.648634 -0.590055
