program: Gaussian 09
title: 000171229
version: EM64L-G09RevD.01
frameworkgroup: C1[X(C10H11N3O4)]
method: RPBEPBE
basis: SDD
operation: Freq
keyword: #p
keyword: freq=noraman
keyword: PBEPBE/SDD
title: #p freq=noraman PBEPBE/SDD
converged: YES YES NO NO
title: Mulliken charges:
elementType: O O O O N N N C C C C C C C C C C H H H H H H H H H H H
charge: -0.240577 -0.431677 -0.265826 -0.237874 -0.169092 -0.404531 0.002449 -0.006182 -0.552537 -0.132132 -0.069984 -0.212056 0.218273 0.234024 -0.170156 0.096730 -0.761698 0.288841 0.260721 0.278349 0.255391 0.305651 0.281797 0.353350 0.362316 0.220798 0.249561 0.246074
chargesum: 0.00000
title: Mulliken charges with hydrogens summed into heavy atoms:
elementType: O O O O N N N C C C C C C C C C C
charge: -0.240577 -0.078327 -0.265826 -0.237874 -0.169092 -0.042215 0.002449 0.282659 -0.013468 0.123259 0.235667 0.069741 0.218273 0.234024 -0.170156 0.096730 -0.045266
polarizability: 1.74591750e+02 1.13685858e+01 1.54238377e+02 1.85295460e+00 3.26356429e+00 8.10300805e+01
1716.lowfreq: -16.6437 -11.4115 -4.2589 -0.0004 -0.0002 0.0002 26.0086 33.6745 52.6572
frequency: 24.9943 33.5928 52.5798 97.4041 106.3211 123.7011 148.3050 150.3522 173.8168 227.9971 252.7432 266.5899 278.2171 282.2343 354.1873 368.0763 379.7746 396.9434 454.2161 464.7243 506.4484 532.8102 541.7199 611.1275 642.5187 698.6443 717.2020 718.3940 740.6061 765.1113 781.2430 829.8212 861.0140 872.7119 888.2600 897.8635 935.6221 971.7573 993.7575 1018.0893 1051.2717 1053.4367 1062.5511 1114.4866 1138.2787 1158.4683 1168.1998 1229.1111 1230.5257 1254.8694 1272.8694 1282.8911 1302.6693 1320.2561 1343.1297 1368.4351 1371.8627 1380.9825 1408.4696 1426.9048 1451.1440 1456.0442 1472.3358 1619.7003 1638.3141 1668.0285 2190.8628 2989.4348 3010.0646 3025.5089 3064.3632 3070.0134 3078.9943 3099.2840 3100.1810 3170.5001 3524.3893 3579.3136
redmass: 5.9407 8.8247 7.6714 4.5725 2.6320 1.3023 6.2097 5.1988 7.9667 6.8181 4.2642 1.3860 3.6330 3.2563 5.4936 4.6252 7.5316 3.3557 4.4649 6.7263 5.1457 5.8122 5.6782 6.6667 4.0817 2.6772 3.9782 6.1276 7.3212 6.2695 2.1415 3.4264 3.8606 3.1715 1.4824 3.2625 2.8077 2.8302 3.5690 1.8796 1.6026 2.2126 2.2094 2.5091 4.5273 1.7785 1.2115 4.5978 1.2755 1.9692 1.6322 1.2168 1.3088 1.5309 1.9331 1.7280 1.5036 2.0417 1.2531 2.3003 1.0434 1.0953 1.0807 6.1024 9.2877 6.1253 12.5470 1.0364 1.0786 1.0714 1.0854 1.0974 1.0888 1.1003 1.1007 1.0935 1.0770 1.0665
irintensity: 5.2709 2.4952 0.9257 2.2192 0.7747 0.5782 3.1047 1.8509 5.4345 10.5329 35.4891 114.9372 2.2378 38.4637 6.7864 11.2168 15.4004 5.4570 2.3185 15.8257 2.6321 23.0832 5.3495 1.6269 7.4942 7.1177 7.4885 6.9835 14.2016 3.7520 112.4951 13.5913 12.8081 17.8090 27.9262 94.5501 35.5374 43.2506 104.0224 31.8665 9.9031 12.3305 23.1792 29.0626 11.7259 61.2691 70.2850 10.6465 12.5160 93.3910 143.3579 1.4160 3.0923 58.8987 49.7894 34.5029 2.8070 19.1606 21.3787 77.6630 13.2328 15.7474 5.0336 200.9989 295.1156 522.0857 0.5713 16.9145 17.9155 21.5062 5.6536 12.4762 1.7877 9.7812 11.5072 3.6401 61.0354 16.8286
temp: 298.150 k
press: 1.00000 atm
elementType: 8 8 8 8 7 7 7 6 6 6 6 6 6 6 6 6 6 1 1 1 1 1 1 1 1 1 1 1
symmnumber: 1
zpe: 546152.9 jmol-1
zpe.correction: 0.208019 hartree
zpe.thermalcorrener: 0.223993 hartree
zpe.thermalcorrenthalpy: 0.224937 hartree
zpe.thermalcorrgfe: 0.163300 hartree
zpe.sumelectzpe: -851.556296 hartree
zpe.sumelectthermal: -851.540322 hartree
zpe.sumelectthermalent: -851.539378 hartree
zpe.sumelectthermalfe: -851.601014 hartree
dipole: -4.3911 -0.9556 3.1732
dipole: 5.5013
quadrupole: -107.8215 -111.5370 -96.5097
quadrupole: 7.8141 -8.4249 -5.3733
quadrupole: -2.5321 -6.2476 8.7797 7.8141 -8.4249 -5.3733
hfenergy: -851.7643143 hartree
pointgroup: C01 [X(C10H11N3O4)]
dipole: 1.6834476 -0.528856 -1.2533288 debye
polarizability: 172.6170425|-12.8854513|156.1533752|1.1562204|-4.0908919|81.0897899 unknown
InChI: InChI=1S/C10H11N3O4/c1-5-4-13(10(16)12-9(5)15)8-2-6(14)7(3-11)17-8/h4,6-8,12,14H,2H2,1H3
charge 0 multiplicity 1
28 atoms
O  1.576675 -0.146437 1.194272
O  3.759672 -1.810758 -0.120029
O  -1.262591 -2.825656 0.314336
O  -4.497934 0.526504 -0.075007
N  -0.541698 -0.584904 0.133276
N  -2.84068 -1.102641 0.134491
N  2.703725 2.873215 -0.034662
C  0.864929 -1.014025 0.213798
C  1.654319 -0.886407 -1.110553
C  3.097559 -0.613243 -0.639967
C  2.869252 0.283324 0.608391
C  -0.872204 0.770627 0.002594
C  -1.534184 -1.597152 0.209892
C  -2.164539 1.229819 -0.076129
C  2.800545 1.719192 0.25196
C  -3.265257 0.253008 -0.013069
C  -2.520202 2.689786 -0.203432
H  0.856871 -2.047189 0.595295
H  1.281969 -0.030791 -1.703174
H  1.567815 -1.798652 -1.722945
H  3.714901 -0.109937 -1.40864
H  3.660089 0.102457 1.356103
H  -0.021776 1.457436 0.004593
H  3.85112 -2.48364 -0.840304
H  -3.582998 -1.807979 0.185234
H  -1.618056 3.323476 -0.238484
H  -3.147816 3.013099 0.646617
H  -3.117805 2.868068 -1.115653
