program: Gaussian 09
title: 000171282
version: EM64L-G09RevD.01
frameworkgroup: C1[X(C20H23NO)]
method: RPBEPBE
basis: SDD
operation: Freq
keyword: #p
keyword: freq=noraman
keyword: PBEPBE/SDD
title: #p freq=noraman PBEPBE/SDD
converged: YES YES NO NO
title: Mulliken charges:
elementType: O N C C C C C C C C C C C C C C C C C C C C H H H H H H H H H H H H H H H H H H H H H H H
charge: -0.312607 -0.138322 -0.176812 0.060978 -0.657014 -0.398759 0.337175 -0.556760 0.168303 0.423816 -0.312035 0.028122 -0.435255 -0.392353 -0.377184 0.181947 -0.484862 -0.263097 -0.388425 -0.216407 -0.686930 -0.523588 0.209629 0.221389 0.249204 0.212242 0.192246 0.237789 0.207095 0.182382 0.195755 0.234777 0.290912 0.217118 0.196680 0.239178 0.227471 0.251268 0.227447 0.208769 0.207749 0.221258 0.219601 0.231486 0.238625
chargesum: 0.00000
title: Mulliken charges with hydrogens summed into heavy atoms:
elementType: O N C C C C C C C C C C C C C C C C C C C C
charge: -0.312607 -0.138322 0.032818 0.060978 -0.186421 0.005729 0.337175 -0.111876 0.168303 0.423816 0.066102 0.028122 -0.200478 -0.101442 0.036614 0.181947 -0.245684 -0.035626 -0.137157 0.011040 -0.049154 0.166123
polarizability: 2.72489760e+02 1.19798668e+01 2.73610283e+02 -5.98788994e+00 2.39228899e+00 1.35642174e+02
1716.lowfreq: -4.9221 -0.0008 -0.0004 -0.0002 5.2167 8.7040 35.0097 59.2775 60.7967
frequency: 34.9595 59.2738 60.7817 64.8061 78.3005 91.6774 131.6879 142.0782 148.9294 187.0679 201.2304 215.5682 238.1452 247.5267 259.4239 270.4409 282.4925 324.8653 353.3626 371.1306 385.7009 417.2793 431.4550 462.7143 472.4104 503.3869 525.7036 539.4656 549.8584 576.2839 581.5961 616.9175 621.8026 656.9990 718.4333 742.7446 743.9120 755.3893 779.3969 795.9374 805.7212 815.9183 850.3343 874.3522 890.0407 902.8103 908.7089 926.6867 938.3134 966.0634 973.6531 991.4143 1001.4338 1007.0018 1028.6214 1045.9281 1052.5239 1070.3587 1080.8984 1097.3110 1104.1366 1109.6941 1120.1185 1132.9520 1150.7028 1156.7834 1168.0750 1177.0217 1187.3044 1197.1380 1207.0688 1216.8808 1231.6658 1237.9574 1254.0131 1270.7910 1276.1115 1294.7179 1296.2077 1309.1741 1312.6809 1330.4970 1344.0299 1364.5961 1369.0711 1370.9532 1386.3075 1392.4665 1422.8544 1433.7752 1441.1814 1448.8612 1453.5506 1459.6912 1468.2807 1469.3892 1469.9481 1472.1039 1476.6916 1477.4898 1477.7956 1489.3200 1572.5962 1595.4622 1597.9480 1606.5569 2790.4869 2843.0281 2855.8345 2962.6590 2973.0971 2979.3885 2981.2433 2990.0227 3028.7508 3034.4342 3044.7848 3048.0456 3054.9807 3058.9738 3072.3640 3075.6843 3114.2750 3115.7317 3123.2507 3142.1016 3144.6985 3167.2158 3170.3996
redmass: 3.9626 2.9235 2.6947 2.5260 2.8883 2.8752 3.1842 3.1210 1.1486 3.2428 2.6092 1.3020 3.7172 3.1723 3.1723 2.7844 3.3492 3.7225 3.3220 4.7200 3.6117 4.0213 3.2694 3.5197 4.0514 5.4970 4.8094 3.7431 3.9291 4.1837 3.5536 3.6060 4.2689 3.5435 5.3031 1.8499 1.3325 2.2558 3.0811 1.9146 2.0124 2.1317 3.2420 1.3277 2.2053 1.9590 1.8078 1.4353 2.8680 2.1548 1.4728 1.3317 2.5266 4.7063 2.4766 2.9480 2.8208 2.3837 2.2058 2.1561 2.1011 1.2513 2.0814 1.9659 1.3552 1.4056 1.1925 1.7317 1.4437 1.7861 1.5762 2.3112 1.5940 1.6882 1.3825 1.5704 1.5776 1.4656 1.4298 1.5446 1.5411 1.7170 1.8927 3.5522 3.3099 1.5288 1.4711 1.3191 1.7864 1.6094 1.5211 1.5799 1.1661 1.0616 2.2549 1.1724 1.1635 1.9608 1.1796 1.0708 1.0553 1.0890 6.4708 7.0819 6.9714 7.0761 1.0784 1.0722 1.0711 1.0313 1.0357 1.0602 1.0640 1.0615 1.0893 1.0999 1.0940 1.0910 1.1038 1.0952 1.1011 1.0989 1.1012 1.0874 1.0872 1.0935 1.0920 1.0982 1.0958
irintensity: 0.1207 0.6573 0.7692 0.2108 0.4602 4.5398 1.1417 0.0498 0.7789 3.4560 2.7692 1.3163 2.3921 2.5005 3.1954 2.6676 0.8566 1.6465 0.6919 2.2958 0.6749 3.2118 4.4902 2.0027 5.5056 2.1943 1.9989 1.2804 3.6423 5.5447 2.4392 0.6161 1.7578 3.0562 11.2729 20.7340 3.3605 48.2073 4.8013 2.0798 51.0249 7.1234 12.1503 4.7098 1.7567 8.2628 2.5962 0.5573 3.3851 17.7728 4.4639 1.1502 11.7203 57.0697 8.2480 4.1451 2.7214 0.5795 20.4564 37.7938 35.2318 1.4437 8.0152 5.8653 2.1810 1.9764 2.9280 5.7237 0.2540 14.8294 10.1190 44.2032 4.4864 13.0301 0.9284 9.4426 3.2394 5.8007 3.2317 7.4122 4.8997 21.1719 6.7078 3.2994 3.2321 1.8262 14.2066 5.7533 25.3572 6.7939 18.4622 21.2463 15.8192 10.7366 1.7402 7.9187 2.9305 10.1588 4.7982 4.7145 12.6721 15.6106 12.7527 20.5578 10.0103 2.7454 43.8089 38.7187 154.7807 64.1273 44.0991 30.2583 18.0264 22.8237 7.3598 29.9243 10.3421 43.0278 35.7560 32.8513 90.0358 49.5371 25.3133 10.1260 6.2357 28.8557 18.8317 21.5704 10.0484
temp: 298.150 k
press: 1.00000 atm
elementType: 8 7 6 6 6 6 6 6 6 6 6 6 6 6 6 6 6 6 6 6 6 6 1 1 1 1 1 1 1 1 1 1 1 1 1 1 1 1 1 1 1 1 1 1 1
symmnumber: 1
zpe: 995552.0 jmol-1
zpe.correction: 0.379186 hartree
zpe.thermalcorrener: 0.398895 hartree
zpe.thermalcorrenthalpy: 0.399839 hartree
zpe.thermalcorrgfe: 0.331346 hartree
zpe.sumelectzpe: -904.290765 hartree
zpe.sumelectthermal: -904.271056 hartree
zpe.sumelectthermalent: -904.270112 hartree
zpe.sumelectthermalfe: -904.338605 hartree
dipole: 1.7096 -0.2004 2.0142
dipole: 2.6495
quadrupole: -127.4717 -119.5331 -131.9210
quadrupole: 0.6690 -4.2360 1.5945
quadrupole: -1.1631 6.7755 -5.6124 0.6690 -4.2360 1.5945
hfenergy: -904.6699509 hartree
pointgroup: C01 [X(C20H23N1O1)]
dipole: -0.660396 -0.1395837 -0.7943499 debye
polarizability: 274.1789467|-12.0203007|271.8288142|-4.6416081|-5.5380444|135.7344564 unknown
InChI: InChI=1S/C20H23NO/c1-3-11-21-12-10-14-6-4-8-16-19(14)17(21)13-15-7-5-9-18(22-2)20(15)16/h4-9,17H,3,10-13H2,1-2H3
charge 0 multiplicity 1
45 atoms
O  3.9728 0.224955 -0.512298
N  -2.61093 -0.044814 -0.096617
C  -1.140735 -0.25501 -0.19776
C  -0.32925 1.021899 0.048513
C  -0.63201 -1.302738 0.824034
C  -3.033111 1.225213 -0.740385
C  -0.938903 2.295672 0.153453
C  -2.446299 2.424654 0.01489
C  1.087179 0.882895 0.209839
C  0.841585 -1.580898 0.575244
C  -3.39755 -1.197358 -0.616297
C  1.683176 -0.484566 0.199697
C  -0.13646 3.436816 0.399931
C  1.867905 2.041345 0.469031
C  -4.783683 -1.32613 0.051883
C  3.050747 -0.774997 -0.093281
C  1.370039 -2.883303 0.708494
C  1.258749 3.310022 0.55827
C  3.575581 -2.076591 0.054369
C  2.739823 -3.133591 0.470873
C  -5.600055 -2.50307 -0.524977
C  3.782912 0.691284 -1.899961
H  -0.872004 -0.631407 -1.223718
H  -1.204851 -2.24372 0.75421
H  -0.798605 -0.89305 1.840778
H  -4.135952 1.274513 -0.725186
H  -2.714303 1.261914 -1.814664
H  -2.909386 2.469687 1.020141
H  -2.703505 3.366476 -0.507127
H  -3.524274 -1.128431 -1.727508
H  -2.835462 -2.130088 -0.428649
H  -0.61381 4.421898 0.47406
H  2.946565 1.93433 0.61142
H  -4.634351 -1.455419 1.140299
H  -5.353415 -0.385119 -0.075702
H  0.704671 -3.703095 1.003559
H  1.873045 4.194757 0.759404
H  4.636241 -2.233775 -0.165384
H  3.148009 -4.143248 0.588599
H  -5.780393 -2.373086 -1.609116
H  -5.068748 -3.464012 -0.387016
H  -6.583167 -2.588839 -0.027934
H  3.907866 -0.15088 -2.607966
H  4.568422 1.44376 -2.069909
H  2.787198 1.152648 -2.038633
