program: Gaussian 09
title: 000171228
version: EM64L-G09RevD.01
frameworkgroup: C1[X(C10H13N3O5)]
method: RPBEPBE
basis: SDD
operation: Freq
keyword: #p
keyword: freq=noraman
keyword: PBEPBE/SDD
title: #p freq=noraman PBEPBE/SDD
converged: YES YES NO NO
title: Mulliken charges:
elementType: O O O O O N N N C C C C C C C C C C H H H H H H H H H H H H H
charge: -0.241505 -0.423166 -0.280182 -0.274437 -0.244822 -0.174143 -0.404495 -0.609457 -0.045752 -0.541136 -0.134714 -0.191092 0.261495 -0.227173 0.215967 0.216436 0.095369 -0.769553 0.258934 0.275592 0.286001 0.268050 0.248355 0.337434 0.354136 0.358623 0.345439 0.328390 0.241885 0.226050 0.243474
chargesum: 0.00000
title: Mulliken charges with hydrogens summed into heavy atoms:
elementType: O O O O O N N N C C C C C C C C C C
charge: -0.241505 -0.069030 -0.280182 -0.274437 -0.244822 -0.174143 -0.045873 0.064371 0.213181 0.020458 0.133336 0.057263 0.261495 0.110261 0.215967 0.216436 0.095369 -0.058144
polarizability: 1.95784473e+02 8.72396274e+00 1.54484879e+02 5.88855337e+00 5.32106335e+00 8.78876454e+01
1716.lowfreq: -7.2096 -4.4974 -0.0004 0.0002 0.0003 7.8843 30.7042 48.1085 65.0660
frequency: 30.5870 48.0878 65.0518 75.6923 104.9393 117.8518 134.3272 149.5936 173.9146 178.2982 229.2450 255.1359 269.2377 275.9571 308.1382 345.4066 353.3839 380.1826 393.3929 429.9413 466.9112 471.0679 529.7582 541.6452 589.7882 601.3572 623.0401 644.9743 699.3112 713.2132 717.5137 724.3200 744.5358 763.8888 780.2812 823.4139 860.4501 873.9426 879.9776 935.7476 948.5286 957.8421 998.4832 1014.1032 1042.7844 1057.7742 1064.5631 1068.5655 1121.5418 1137.4506 1165.2765 1188.4231 1235.3528 1253.0776 1266.7632 1268.2561 1291.5654 1301.6408 1323.4131 1348.3991 1371.9835 1374.7479 1381.0489 1396.7964 1405.9329 1440.4784 1449.1085 1453.8123 1473.8396 1595.7833 1619.4156 1635.9875 1645.2773 1667.7937 2987.0657 3035.3152 3038.8129 3042.0207 3066.2629 3095.7536 3099.8721 3108.1292 3112.6656 3513.8363 3525.7703 3553.7710 3665.3059
redmass: 4.8491 7.3608 6.3956 6.2408 4.9436 4.0967 1.1268 5.9271 7.4752 4.1091 4.0486 6.3548 4.0922 3.3031 1.3557 5.9009 3.5359 9.8353 3.9802 3.1708 3.9234 5.6975 1.1553 4.5105 4.1219 1.6743 3.0839 3.9374 2.6171 4.1019 3.8611 5.4466 7.4441 5.8828 2.2537 3.3245 3.5712 3.3791 4.2312 2.3922 2.2559 1.4009 4.1292 1.9659 2.3182 1.4592 1.9469 2.3890 2.4029 4.2727 1.7574 1.3656 5.2630 1.5603 1.4675 2.6994 1.4028 1.5364 1.3802 1.8629 1.8348 2.1709 1.3452 1.8024 1.2961 1.6729 1.1314 1.0439 1.0779 1.6263 5.6707 7.6872 2.8619 5.6855 1.0364 1.0849 1.0828 1.0661 1.0974 1.0888 1.1007 1.0983 1.1040 1.0452 1.0769 1.0663 1.1043
irintensity: 3.3320 2.6768 6.5393 6.4429 6.0826 8.2112 0.6781 0.2110 5.2931 1.5171 1.4917 9.2782 6.4381 7.3885 87.9076 10.0573 12.0807 21.2698 3.9234 23.5113 2.8980 10.9093 76.5631 26.8513 5.6579 140.4274 31.8576 7.5786 18.2258 26.0901 5.3072 19.1429 6.6159 24.2327 113.6588 26.8796 12.2276 15.6855 60.0854 9.6471 38.4709 17.1106 154.1637 47.5134 37.0811 7.1771 11.4727 26.9489 61.3513 14.4428 18.1071 131.2481 9.9051 17.5737 11.3976 222.3954 58.1737 20.7718 68.1988 40.5523 89.1332 10.0212 61.4262 17.9750 13.1154 53.1878 32.1239 11.6418 4.3415 37.9407 257.4944 365.9914 245.5508 534.2154 20.9612 24.2376 19.0459 5.0605 15.2322 11.0939 22.6086 118.1419 7.9352 58.7182 56.9842 12.8139 32.3238
temp: 298.150 k
press: 1.00000 atm
elementType: 8 8 8 8 8 7 7 7 6 6 6 6 6 6 6 6 6 6 1 1 1 1 1 1 1 1 1 1 1 1 1
symmnumber: 1
zpe: 622739.4 jmol-1
zpe.correction: 0.237189 hartree
zpe.thermalcorrener: 0.254264 hartree
zpe.thermalcorrenthalpy: 0.255208 hartree
zpe.thermalcorrgfe: 0.191874 hartree
zpe.sumelectzpe: -927.925976 hartree
zpe.sumelectthermal: -927.908902 hartree
zpe.sumelectthermalent: -927.907957 hartree
zpe.sumelectthermalfe: -927.971291 hartree
dipole: -7.2932 2.1471 -0.0076
dipole: 7.6027
quadrupole: -108.1746 -106.3748 -104.6579
quadrupole: -13.3448 8.4280 -3.6036
quadrupole: -1.7721 0.0276 1.7445 -13.3448 8.4280 -3.6036
hfenergy: -928.1631651 hartree
pointgroup: C01 [X(C10H13N3O5)]
dipole: -2.8960448 -0.7385584 -0.1193023 debye
polarizability: 195.3707827|-10.2338585|154.62833|-2.6726668|7.8848786|88.1578843 unknown
InChI: InChI=1S/C10H13N3O5/c1-4-3-13(10(17)12-9(4)16)6-2-5(14)7(18-6)8(11)15/h3,5-7,12,14H,2,11H2,1H3
charge 0 multiplicity 1
31 atoms
O  -1.43995 0.413212 0.977777
O  -3.509219 2.205597 -0.635565
O  -1.861344 -2.039001 -0.603373
O  1.625496 2.754364 0.564926
O  4.609101 -0.806105 0.068892
N  0.75462 0.635329 -0.023807
N  3.069924 0.93109 0.304655
N  -3.934435 -2.100263 0.43605
C  -0.611734 1.171801 -0.01199
C  -1.377137 1.07604 -1.351517
C  -2.851701 0.927348 -0.919631
C  -2.734539 0.053273 0.369137
C  -2.786076 -1.45182 0.037586
C  0.987958 -0.723098 -0.287285
C  1.806985 1.530276 0.307892
C  2.242915 -1.283683 -0.278039
C  3.401192 -0.4315 0.028614
C  2.490745 -2.746269 -0.553872
H  -0.507539 2.210164 0.349418
H  -1.060974 0.17825 -1.9087
H  -1.225966 1.966462 -1.981512
H  -3.48686 0.464274 -1.689388
H  -3.529109 0.33426 1.083454
H  0.084929 -1.316992 -0.472953
H  -2.940501 2.751201 -0.033563
H  3.853598 1.551792 0.531205
H  -4.044103 -3.088935 0.207273
H  -4.654334 -1.639074 0.99033
H  3.172269 -2.872947 -1.414741
H  1.54714 -3.277037 -0.764039
H  2.986448 -3.22821 0.308366
