program: Gaussian 09
title: 000171438
version: EM64L-G09RevD.01
frameworkgroup: C1[X(C18H23N5O9)]
method: RPBEPBE
basis: SDD
operation: Freq
keyword: #p
keyword: freq=noraman
keyword: PBEPBE/SDD
title: #p freq=noraman PBEPBE/SDD
converged: YES YES NO NO
title: Mulliken charges:
elementType: O O O O O O O O O N N N N N C C C C C C C C C C C C C C C C C C H H H H H H H H H H H H H H H H H H H H H H H
charge: -0.292648 -0.271361 -0.237911 -0.452300 -0.288640 -0.437080 -0.452775 -0.234129 -0.275082 -0.176482 -0.092430 -0.060954 -0.065990 -0.612652 -0.152144 -0.031574 0.335431 -0.150047 -0.519724 -0.128574 -0.295143 -0.082701 -0.177568 -0.208246 0.274308 0.156341 -0.235854 -0.517314 -0.102236 0.156927 -0.501167 -0.374091 0.295576 0.246691 0.288691 0.250176 0.245348 0.261206 0.271155 0.271601 0.261048 0.298088 0.373096 0.380496 0.363062 0.352176 0.237279 0.210953 0.233086 0.245983 0.255431 0.250160 0.240337 0.343358 0.328812
chargesum: 0.00000
title: Mulliken charges with hydrogens summed into heavy atoms:
elementType: O O O O O O O O O N N N N N C C C C C C C C C C C C C C C C C C
charge: -0.292648 -0.271361 -0.237911 -0.079205 -0.288640 -0.056584 -0.089713 -0.234129 -0.275082 -0.176482 -0.092430 -0.060954 -0.065990 0.059517 0.143432 0.215117 0.335431 0.138644 -0.024200 0.132633 -0.023988 0.188900 0.083480 0.089842 0.274308 0.156341 0.116322 0.164005 -0.102236 0.156927 0.250408 -0.133754
polarizability: 3.10891691e+02 -1.45891059e+01 2.67384090e+02 -7.98949389e+00 -1.84389546e+01 1.93408039e+02
1716.lowfreq: -4.3054 0.0007 0.0007 0.0011 7.2112 10.8458 18.2601 32.8244 42.8739
frequency: 17.9868 32.7630 42.8538 44.5996 51.8951 69.2898 81.0225 82.6976 95.0695 117.3185 121.3652 134.8148 148.7268 159.3800 174.2940 176.1804 191.7489 201.4157 212.6975 213.2509 225.9506 239.4634 255.4048 259.2935 262.1201 276.8950 278.2349 289.8865 308.5156 314.4200 318.3473 338.7441 382.3414 403.6007 412.1545 426.6474 450.0643 476.1468 492.2365 502.8499 507.3299 510.3695 546.8152 550.2825 553.5895 566.4872 598.1802 606.4459 619.1581 643.3321 653.0891 669.9026 681.1772 692.2607 696.9299 711.7184 723.1668 738.7440 766.5122 788.4417 798.4158 805.0303 824.8867 836.5366 852.2665 864.1557 870.5432 893.1729 908.0538 925.4501 927.3265 939.6092 950.4471 959.1485 962.4052 969.6311 975.8665 990.4999 1000.5197 1027.4096 1032.6135 1037.8732 1045.0784 1056.7965 1060.1547 1075.7367 1093.0753 1113.7498 1121.0189 1122.0212 1134.0266 1150.1720 1155.2674 1165.4994 1182.6411 1191.6601 1198.8061 1211.3941 1222.5396 1233.0204 1240.6469 1242.9656 1261.8305 1270.0831 1273.9522 1287.3245 1297.1964 1299.8595 1305.6570 1310.6153 1315.6920 1321.6273 1325.7021 1333.3010 1335.9431 1347.6621 1356.4104 1359.9003 1374.4658 1380.7558 1386.2186 1391.3347 1419.5245 1423.5408 1430.8497 1438.6444 1449.2931 1453.4527 1459.2880 1462.2968 1466.5948 1478.3176 1541.9360 1578.2098 1598.7915 1631.5256 2944.8885 2993.9081 2998.4161 3005.9613 3015.6922 3020.2944 3021.6572 3027.9107 3028.4462 3030.2404 3080.8178 3091.0173 3091.8947 3115.2540 3122.8633 3163.4806 3166.8767 3194.2011 3244.0894 3379.9567 3541.3522 3566.4732 3697.3236
redmass: 6.5060 4.8522 6.2183 5.4393 4.8814 3.6652 1.5679 3.8863 3.3034 4.0037 5.0703 5.5893 3.1621 4.3572 1.9069 4.7775 1.8306 3.4414 3.2173 5.3669 5.3437 5.3386 7.3120 5.7995 3.9120 4.2809 5.3258 4.7807 3.6236 5.0662 4.0140 5.0006 5.3918 5.5428 4.9026 4.2665 6.5708 4.9340 5.2320 1.2326 4.8972 8.7482 1.0426 3.4741 1.5514 4.0222 5.4624 3.5246 7.7841 5.0046 6.7075 5.2094 2.6547 2.5750 2.8647 4.1829 6.0651 5.5924 6.0532 4.9586 10.9268 5.7380 4.9564 5.0742 7.8429 5.6443 3.5431 4.5189 3.8676 1.3976 1.3509 3.9721 3.9721 3.6027 2.4296 3.5295 5.3240 3.9270 4.0719 3.4097 4.1945 4.1549 2.9018 4.5568 2.2832 2.1792 2.7211 1.2670 1.9630 1.9848 2.8640 1.4859 1.4972 1.9832 2.0483 2.2750 1.3845 1.5760 1.6775 1.8840 1.3199 1.6498 2.4084 1.2183 1.1714 1.4758 1.9573 1.3306 1.5084 2.7901 3.8615 1.5951 1.5737 1.4647 1.4555 1.4929 1.4419 2.5411 1.5804 2.9173 1.6048 1.5109 1.1757 1.2302 2.9414 1.1244 1.0903 1.0492 1.0505 3.7354 1.0740 1.0522 8.2091 1.8382 7.0752 2.8300 1.0335 1.0837 1.0859 1.0863 1.0292 1.0835 1.0859 1.0625 1.1016 1.0860 1.0875 1.0863 1.1032 1.0989 1.1052 1.0919 1.1057 1.1029 1.0698 1.0658 1.0441 1.0661 1.1057
irintensity: 0.3624 1.6798 1.1368 1.3568 1.2806 3.8302 0.1664 4.5123 1.3695 5.0593 2.3630 6.3814 2.0619 41.3227 8.1359 8.9128 88.9931 0.1014 73.7890 1.9143 0.5175 4.4818 15.1049 16.4059 18.8252 8.1238 3.0874 20.1014 38.5449 4.4988 7.9663 45.1475 0.9505 6.7953 3.5680 4.1140 1.3307 2.5434 1.7837 264.4312 5.6119 3.0334 2.6506 17.1728 58.8063 0.9120 18.0218 5.3617 0.2861 47.1033 19.2000 15.9915 59.7149 77.0066 19.5959 6.6068 11.6239 28.6666 39.8516 5.2402 6.9333 19.4313 29.8236 28.1366 4.7122 10.3310 12.5607 5.7145 41.9682 22.9307 4.3269 53.6292 31.9760 72.4904 6.9975 25.7973 78.9660 71.1809 268.3375 1.9100 8.9427 28.9686 1.4764 192.1024 46.7210 53.6811 7.1451 0.2297 8.3340 3.7591 22.8479 10.4573 20.8382 91.7761 78.3899 25.3163 90.4494 31.2153 29.5434 74.8106 20.5604 37.9260 54.1982 15.0232 36.6570 2.8742 62.2994 14.7916 41.2790 14.7562 20.8829 42.2081 20.5148 9.4321 6.7734 65.6809 39.3133 59.0600 1.2755 3.9866 3.5378 12.2849 76.7229 16.9190 87.4493 4.1453 12.4298 19.1049 13.2800 34.0940 13.2475 15.1674 65.3211 36.2801 208.8571 612.2881 53.6413 25.8291 27.2214 24.0564 21.5601 5.4682 15.1321 23.9175 36.3691 37.0886 15.2237 4.0333 9.3184 28.0685 16.3176 20.6251 13.8326 132.7542 418.5073 158.4941 115.7885 21.5164 48.3710
temp: 298.150 k
press: 1.00000 atm
elementType: 8 8 8 8 8 8 8 8 8 7 7 7 7 7 6 6 6 6 6 6 6 6 6 6 6 6 6 6 6 6 6 6 1 1 1 1 1 1 1 1 1 1 1 1 1 1 1 1 1 1 1 1 1 1 1
symmnumber: 1
zpe: 1108851.9 jmol-1
zpe.correction: 0.422339 hartree
zpe.thermalcorrener: 0.451534 hartree
zpe.thermalcorrenthalpy: 0.452478 hartree
zpe.thermalcorrgfe: 0.362642 hartree
zpe.sumelectzpe: -1648.033732 hartree
zpe.sumelectthermal: -1648.004538 hartree
zpe.sumelectthermalent: -1648.003594 hartree
zpe.sumelectthermalfe: -1648.093430 hartree
dipole: 5.6042 2.1327 -1.2468
dipole: 6.1245
quadrupole: -173.0231 -165.8205 -181.1540
quadrupole: 18.0986 2.4560 4.5524
quadrupole: 0.3094 7.5120 -7.8214 18.0986 2.4560 4.5524
hfenergy: -1648.4560719 hartree
pointgroup: C01 [X(C18H23N5O9)]
dipole: -2.1691668 -0.9131932 -0.5166082 debye
polarizability: 311.5871322|-13.3408232|266.5959143|9.0136158|18.2617825|193.5007736 unknown
InChI: InChI=1S/C18H23N5O9/c1-28-12-10-6(30-16(12)23-5-22-8-14(19)20-4-21-15(8)23)3-7-18(27,32-10)13(25)9(24)11(31-7)17(26)29-2/h4-7,9-13,16,24-25,27H,3,19H2,1-2H3
charge 0 multiplicity 1
55 atoms
O  -0.748335 1.528278 -1.065697
O  0.589336 1.026096 1.52543
O  -3.680884 0.269272 0.894605
O  -2.921116 2.384185 -0.918969
O  1.844636 3.764701 0.131162
O  -1.631166 -1.012142 -1.93897
O  -4.973231 0.741849 -1.820507
O  -4.687497 -2.722927 1.1748
O  -2.702103 -2.625255 -0.014119
N  2.224746 0.109078 0.020276
N  2.316471 -1.801745 -1.247649
N  4.514259 0.059511 0.992248
N  5.796326 -1.897723 0.229295
N  4.913663 -3.510002 -1.259682
C  -0.210651 2.544424 -0.130848
C  -0.40762 2.121763 1.338815
C  -2.118606 1.169566 -0.793329
C  -2.246575 0.575393 0.632088
C  -1.800587 1.58541 1.687405
C  1.313991 2.47556 -0.304382
C  -2.54589 0.112449 -1.850828
C  1.757531 1.328337 0.671754
C  -4.007137 -0.351287 -1.541904
C  -4.274126 -0.698577 -0.052167
C  -3.798894 -2.103048 0.335333
C  3.499971 -0.436453 0.225861
C  1.556694 -0.751967 -0.878944
C  3.267719 3.938837 -0.192829
C  3.534637 -1.613152 -0.564803
C  4.75042 -2.35599 -0.539852
C  -4.274808 -4.049868 1.715279
C  5.623748 -0.738432 0.936473
H  -0.62513 3.537713 -0.364218
H  -0.138127 2.974655 1.993185
H  -1.635248 -0.344528 0.699191
H  -1.781748 1.119147 2.686961
H  -2.515107 2.427302 1.705068
H  1.595824 2.253978 -1.35257
H  -2.515715 0.598924 -2.84345
H  2.594839 1.669438 1.309581
H  -4.23233 -1.230896 -2.178531
H  -5.35803 -0.624492 0.126365
H  -3.883792 2.117677 -0.98794
H  -1.848861 -1.699684 -1.235373
H  -4.961822 0.948809 -2.78969
H  0.542917 -0.55763 -1.232237
H  3.533099 4.946524 0.161213
H  3.431632 3.872952 -1.288161
H  3.90609 3.187656 0.314573
H  -5.125343 -4.373604 2.328897
H  -3.361284 -3.934631 2.320689
H  -4.082397 -4.749732 0.885978
H  6.484007 -0.412185 1.528682
H  4.148948 -3.857718 -1.834162
H  5.802854 -4.002216 -1.210397
