program: Gaussian 09
title: 000171213
version: EM64L-G09RevD.01
frameworkgroup: C1[X(C19H12FNS)]
method: RPBEPBE
basis: SDD
operation: Freq
keyword: #p
keyword: freq=noraman
keyword: PBEPBE/SDD
title: #p freq=noraman PBEPBE/SDD
converged: YES YES NO NO
title: Mulliken charges:
elementType: S F N C C C C C C C C C C C C C C C C C C C H H H H H H H H H H H H
charge: 0.203778 -0.203590 -0.480104 0.230879 0.032607 0.139003 0.196747 0.263337 -0.837185 0.553874 0.410930 -0.407235 -0.392886 -0.470418 -0.392763 -0.357928 -0.460919 -0.440916 -0.268174 -0.414628 -0.248669 0.337425 0.314239 0.265812 0.284070 0.235606 0.239679 0.220672 0.218826 0.240070 0.274973 0.226924 0.257729 0.228237
chargesum: 0.00000
title: Mulliken charges with hydrogens summed into heavy atoms:
elementType: S F N C C C C C C C C C C C C C C C C C C C
charge: 0.203778 -0.203590 -0.165865 0.230879 0.032607 0.139003 0.196747 0.263337 -0.287303 0.553874 0.410930 -0.407235 -0.157280 -0.230739 -0.172091 -0.139102 -0.220850 -0.165943 -0.041251 -0.156899 -0.020432 0.337425
polarizability: 4.46699754e+02 -2.07084975e+01 2.42328879e+02 -1.31913784e+00 -1.65501995e+00 9.50370665e+01
1716.lowfreq: -7.9873 -0.0014 -0.0005 0.0011 1.1113 7.0037 33.7899 49.7932 85.1098
frequency: 33.7690 49.7165 85.1087 101.7914 117.7083 157.2869 185.3907 198.9549 207.3989 268.8387 283.3020 297.0113 327.5358 366.1819 382.4545 403.1757 422.5489 442.3140 449.1964 466.5121 507.5196 522.1228 539.4493 553.4823 563.4649 568.5641 578.7489 621.2878 659.9497 669.8403 678.4724 695.1066 722.9951 735.5057 738.4748 752.2987 778.3013 797.9215 806.1601 810.9170 854.1728 865.6944 877.0157 877.5282 919.0497 929.1693 943.5296 960.2969 986.4080 988.1617 1017.6656 1042.8637 1052.3618 1106.6568 1128.4018 1147.5935 1151.1222 1169.0792 1177.3265 1193.7095 1225.7693 1231.1950 1247.4829 1269.2002 1277.2274 1301.3574 1334.0253 1362.9435 1389.1436 1392.0001 1401.0835 1418.8804 1443.7428 1446.6583 1459.2537 1462.3419 1491.7980 1542.5089 1551.1744 1573.0993 1586.7807 1600.9223 1609.0353 1627.2485 3005.0242 3092.6725 3121.0345 3127.2322 3130.6666 3134.7077 3150.3749 3155.3464 3169.9771 3171.8722 3181.8997 3608.6783
redmass: 8.1731 5.1759 6.1967 3.0074 5.8713 5.2232 6.7693 6.9334 3.6972 6.3462 7.4853 6.0394 5.1631 7.2719 5.8277 7.3999 3.1045 4.1727 4.9361 5.7116 6.2108 3.5922 1.2257 4.4562 3.4534 3.8251 6.3323 6.3787 4.9751 7.1269 5.8043 3.7688 5.3358 4.1314 4.6132 1.3466 5.7151 2.9997 1.5370 1.4826 6.2734 1.4942 2.1480 2.6373 1.9908 1.4020 1.3389 1.4141 1.3503 7.1116 3.7997 2.3157 2.6745 1.9648 1.4739 1.2718 1.2825 1.5395 1.3200 2.7363 1.5307 1.7821 1.6689 1.4549 1.5367 2.3989 3.9194 4.5355 4.5595 7.0562 2.1934 3.8079 2.2921 1.2690 2.6582 4.7241 4.5255 5.1693 7.4965 6.6742 6.2428 7.0901 6.9119 6.6894 1.0633 1.0995 1.0865 1.0866 1.0894 1.0892 1.0981 1.0952 1.0927 1.0969 1.0955 1.0802
irintensity: 0.0449 0.4328 0.5527 1.4547 0.4187 0.1769 0.9031 1.8932 7.5959 0.4303 0.3518 2.5260 1.7025 1.3016 1.2790 3.0125 2.9432 6.7215 6.5898 6.8400 0.2677 7.5473 75.8885 2.1083 19.5054 4.3518 9.9219 1.2135 6.1955 2.5181 1.1669 8.3196 7.8147 0.3861 11.9411 23.7051 3.5225 8.2763 47.8199 78.8542 69.5124 34.9392 5.4574 6.3007 2.1033 0.2708 0.3123 2.3355 0.5823 5.3945 8.8270 10.0614 2.2965 8.7781 1.4161 1.0936 7.5800 22.8645 16.9729 41.6800 7.4693 5.5539 0.7462 37.3987 18.7492 2.4123 6.1151 19.8594 42.6325 0.3837 4.3127 35.3130 72.4888 10.6270 1.8196 2.6262 126.2635 3.7205 22.4533 17.5783 23.4343 11.9983 9.0377 5.2507 24.7062 4.2631 3.7179 0.3976 14.5158 9.1857 24.6372 48.0255 1.0171 22.4489 4.5965 48.9534
temp: 298.150 k
press: 1.00000 atm
elementType: 16 9 7 6 6 6 6 6 6 6 6 6 6 6 6 6 6 6 6 6 6 6 1 1 1 1 1 1 1 1 1 1 1 1
symmnumber: 1
zpe: 665296.8 jmol-1
zpe.correction: 0.253398 hartree
zpe.thermalcorrener: 0.269840 hartree
zpe.thermalcorrenthalpy: 0.270784 hartree
zpe.thermalcorrgfe: 0.209251 hartree
zpe.sumelectzpe: -1282.439980 hartree
zpe.sumelectthermal: -1282.423539 hartree
zpe.sumelectthermalent: -1282.422594 hartree
zpe.sumelectthermalfe: -1282.484128 hartree
dipole: 2.1184 2.4718 0.5584
dipole: 3.3030
quadrupole: -140.7251 -113.2872 -140.8458
quadrupole: -5.5352 -1.0254 -2.9381
quadrupole: -9.1057 18.3321 -9.2264 -5.5352 -1.0254 -2.9381
hfenergy: -1282.6933787 hartree
pointgroup: C01 [X(C19H12F1N1S1)]
dipole: 0.8139702 -0.9789744 -0.260262 debye
polarizability: 447.3923645|16.9600971|241.5790415|-0.4810364|3.4353876|95.0942938 unknown
InChI: InChI=1S/C19H12FNS/c20-12-6-7-14-17(9-12)22-10-15-18-13-4-2-1-3-11(13)5-8-16(18)21-19(14)15/h1-9,21H,10H2
charge 0 multiplicity 1
34 atoms
S  -1.926639 2.405568 0.679893
F  -6.568275 0.208776 -0.03282
N  -0.287912 -1.72997 0.084817
C  0.058128 0.516226 -0.055197
C  1.350213 -0.135968 -0.01183
C  -0.928879 -0.486364 -0.005875
C  1.093194 -1.542342 0.095164
C  2.723757 0.319163 -0.063393
C  -0.282571 1.974891 -0.185373
C  -2.3781 -0.319598 -0.049333
C  3.769088 -0.681723 0.064898
C  -2.952858 0.962778 0.223037
C  2.117691 -2.521684 0.209965
C  3.437951 -2.080056 0.204049
C  3.114754 1.683644 -0.24448
C  -3.255469 -1.400064 -0.34551
C  5.139125 -0.268228 0.039401
C  -4.35392 1.138793 0.224871
C  4.464647 2.057935 -0.268201
C  -4.656115 -1.24568 -0.337038
C  5.488346 1.076957 -0.117642
C  -5.170609 0.028005 -0.041916
H  -0.757188 -2.620624 0.232574
H  0.443259 2.619279 0.334337
H  -0.36484 2.30367 -1.236977
H  1.876199 -3.586162 0.301754
H  4.257773 -2.801467 0.296612
H  2.35182 2.453541 -0.387568
H  -2.840174 -2.379182 -0.610258
H  5.919901 -1.031656 0.141315
H  -4.805726 2.114487 0.424445
H  4.736248 3.109819 -0.410004
H  -5.330678 -2.075921 -0.561222
H  6.541358 1.377856 -0.135493
