program: Gaussian 09
title: 000171198
version: EM64L-G09RevD.01
frameworkgroup: C1[X(C13H19N3O8)]
method: RPBEPBE
basis: SDD
operation: Freq
keyword: #p
keyword: freq=noraman
keyword: PBEPBE/SDD
title: #p freq=noraman PBEPBE/SDD
converged: YES YES NO NO
title: Mulliken charges:
elementType: O O O O O O O O N N N C C C C C C C C C C C C C H H H H H H H H H H H H H H H H H H H
charge: -0.263152 -0.466788 -0.440859 -0.443021 -0.333116 -0.246221 -0.407949 -0.233036 -0.202174 -0.220616 -0.617568 -0.194658 -0.075438 -0.140209 -0.048671 -0.363707 0.299098 -0.100929 -0.359156 -0.385902 -0.339039 0.204805 -0.138816 0.150037 0.238555 0.288801 0.225927 0.287976 0.198948 0.218905 0.394821 0.376577 0.330459 0.258289 0.231357 0.227145 0.250053 0.258915 0.354559 0.256556 0.280127 0.307729 0.381388
chargesum: 0.00000
title: Mulliken charges with hydrogens summed into heavy atoms:
elementType: O O O O O O O O N N N C C C C C C C C C C C C C
charge: -0.263152 -0.071967 -0.064282 -0.088462 -0.333116 -0.246221 -0.026561 -0.233036 -0.202174 -0.220616 -0.029712 0.043897 0.213363 0.085718 0.239305 0.054146 0.299098 0.229530 0.130490 0.091295 -0.080124 0.204805 0.117740 0.150037
polarizability: 2.23069599e+02 1.07688568e+01 1.99773088e+02 -4.17624616e+00 1.07964711e+01 1.37532649e+02
1716.lowfreq: -11.2520 -2.8343 0.0003 0.0006 0.0008 6.9934 14.9953 21.4626 25.7107
frequency: 14.9713 21.1225 25.6405 35.4366 43.4971 59.9912 68.3284 91.5125 97.9063 109.0557 125.5012 156.0445 174.6262 184.0548 191.4700 196.2323 222.2387 259.7920 268.6126 284.0904 295.9863 310.4981 319.6363 336.3702 356.9325 368.7088 371.6005 380.4669 420.1115 446.3939 474.0688 479.9791 490.2018 518.9156 531.7342 546.5441 574.7575 595.6996 605.1466 631.0919 670.4177 685.8257 692.7388 704.2455 707.8985 732.2221 745.5165 775.8039 802.3667 815.9285 819.6006 841.1254 873.5019 907.9113 932.5895 963.0232 971.9430 986.0839 994.3558 1005.6155 1030.5703 1042.7522 1049.8393 1055.2039 1064.2739 1073.4520 1073.7792 1082.2828 1100.5452 1118.6289 1165.3354 1175.6011 1179.1087 1200.5211 1201.3877 1228.2873 1233.7634 1239.1477 1255.9508 1258.1689 1271.0280 1279.6676 1294.2596 1309.0775 1317.2475 1323.3925 1334.8422 1335.9608 1348.0038 1358.5838 1375.8801 1379.9042 1385.2286 1387.8071 1410.8840 1417.1149 1443.1115 1459.7696 1467.0952 1554.2994 1605.4050 1610.6444 1651.8177 1670.5920 2933.5125 2971.7928 2991.5351 2993.7025 2997.4119 3009.1114 3030.3709 3032.6721 3068.2734 3099.9260 3103.9310 3161.8532 3212.4539 3360.0206 3454.5433 3508.8076 3511.3641 3576.6200 3654.2978
redmass: 6.3700 6.6252 6.2598 6.8895 5.8499 8.1461 5.4959 5.5435 3.3865 5.3805 4.7926 4.5544 5.2350 4.8032 1.7367 4.9533 2.9364 5.1792 1.1675 3.8353 4.6187 3.0011 6.7210 2.8978 4.2551 2.9206 6.7761 4.3480 4.7386 1.7019 5.0134 1.7404 4.4622 1.6684 4.8085 5.1488 5.1336 1.9416 2.1041 4.2337 3.9465 3.8724 1.1984 4.7508 4.5853 5.2387 5.9410 1.4578 3.8041 2.0963 2.5432 3.5448 3.2352 2.9287 3.6389 4.8494 2.1410 2.0484 1.6277 3.0533 4.0481 6.3961 3.1561 3.0918 3.8516 2.7240 3.1627 2.4733 2.6068 1.3280 3.0486 1.6895 1.3470 1.3517 2.1899 1.2849 1.4304 1.2124 1.2275 1.5667 1.5776 1.2468 1.4304 1.4246 1.2430 1.2499 1.3096 1.2876 1.3308 1.7316 1.6766 1.5848 1.6687 1.6881 2.4529 1.4704 1.1685 1.0974 1.0781 7.3603 1.6100 3.2971 7.8660 4.3229 1.0572 1.0853 1.0958 1.0930 1.0628 1.0802 1.0865 1.0577 1.1034 1.0885 1.1065 1.0941 1.0961 1.0649 1.0647 1.0464 1.0628 1.0668 1.0999
irintensity: 0.0660 0.5290 0.6691 0.2672 2.6678 1.9212 7.9291 2.9062 0.7997 5.3354 9.3731 16.1879 4.3197 2.0371 39.1204 5.1896 29.1790 24.7980 154.8628 24.7422 4.8209 11.9241 3.9200 28.4095 12.5118 25.6808 3.4408 14.3856 134.5360 227.7819 2.2146 121.3972 24.5964 62.8023 17.1996 11.5003 26.4909 105.6085 57.4122 33.3454 38.9839 3.9967 91.9009 18.5637 26.9210 15.0353 17.6897 3.5822 23.9972 51.6384 17.0637 1.2327 5.1446 3.2198 13.1581 50.8918 36.6077 13.5711 35.6700 51.2497 50.7106 147.1008 213.0167 93.2375 26.0476 6.4731 80.1100 27.6431 22.8310 9.6452 10.7675 68.6160 26.1882 18.7185 6.7731 30.7448 0.3097 113.8852 6.2015 20.7786 46.6055 11.1145 23.4286 59.3717 12.8383 23.1785 23.6170 24.7654 18.8568 62.1740 65.4468 136.7055 63.2825 20.9025 65.8854 3.6639 56.1546 19.8462 6.9269 262.1482 40.0445 184.8288 423.5680 171.8212 45.0648 15.2967 80.1212 56.4431 6.5282 20.5997 10.8475 21.5339 9.9353 16.0371 3.5829 31.4454 0.3688 272.3124 41.2172 15.4534 22.8218 7.9979 11.7164
temp: 298.150 k
press: 1.00000 atm
elementType: 8 8 8 8 8 8 8 8 7 7 7 6 6 6 6 6 6 6 6 6 6 6 6 6 1 1 1 1 1 1 1 1 1 1 1 1 1 1 1 1 1 1 1
symmnumber: 1
zpe: 872114.1 jmol-1
zpe.correction: 0.332171 hartree
zpe.thermalcorrener: 0.356396 hartree
zpe.thermalcorrenthalpy: 0.357340 hartree
zpe.thermalcorrgfe: 0.275390 hartree
zpe.sumelectzpe: -1270.981150 hartree
zpe.sumelectthermal: -1270.956925 hartree
zpe.sumelectthermalent: -1270.955981 hartree
zpe.sumelectthermalfe: -1271.037930 hartree
dipole: -2.2183 1.2315 3.6161
dipole: 4.4174
quadrupole: -158.8662 -158.8265 -124.8528
quadrupole: -5.5871 -14.2794 8.9286
quadrupole: -11.3511 -11.3113 22.6624 -5.5871 -14.2794 8.9286
hfenergy: -1271.3133209 hartree
pointgroup: C01 [X(C13H19N3O8)]
dipole: 0.9325408 -0.3829334 1.4156776 debye
polarizability: 222.804537|10.9342585|198.7169962|0.7498428|-14.7238401|138.8538019 unknown
InChI: InChI=1S/C13H19N3O8/c14-6(12(21)22)1-3-15-8(18)2-4-16(13(15)23)11-10(20)9(19)7(5-17)24-11/h2,4,6-7,9-11,17,19-21H,1,3,5,14H2
charge 0 multiplicity 1
43 atoms
O  3.735043 -0.343177 -0.72493
O  1.88611 2.725989 -0.635183
O  4.531549 2.59267 -0.58733
O  4.681016 -1.794069 1.47644
O  -0.145196 0.997145 -1.302066
O  -1.798954 -3.282474 -0.27075
O  -5.598986 -0.439088 1.928899
O  -5.228376 1.847157 1.750063
N  1.35619 -0.684844 -0.685601
N  -0.974063 -1.147168 -0.807777
N  -4.584406 1.523423 -0.934504
C  2.388079 1.537144 0.020255
C  2.465615 0.305711 -0.940027
C  3.8727 1.771168 0.414235
C  4.469058 0.351116 0.379133
C  4.306358 -0.395379 1.710944
C  0.056977 -0.216571 -0.952425
C  1.61365 -1.991898 -0.284696
C  -2.364546 -0.685733 -1.060714
C  -3.042152 -0.180126 0.230801
C  0.592598 -2.897239 -0.128186
C  -0.792024 -2.526405 -0.385704
C  -4.493618 0.347058 -0.073993
C  -5.141902 0.699254 1.2617
H  1.782261 1.278916 0.912573
H  2.387659 0.631496 -1.993835
H  3.954388 2.239776 1.416569
H  5.524372 0.361014 0.066009
H  3.25923 -0.327137 2.080027
H  4.974164 0.085697 2.457062
H  1.005253 2.461245 -1.035945
H  3.825859 3.184992 -0.971666
H  2.670103 -2.218782 -0.110099
H  -2.919114 -1.550943 -1.462262
H  -2.310105 0.119527 -1.811933
H  -2.448405 0.644617 0.668283
H  -3.099432 -1.01125 0.95726
H  0.791321 -3.921625 0.187272
H  4.776999 -2.260768 2.343953
H  -5.067098 -0.491686 -0.513502
H  -4.193217 1.447677 -1.871956
H  -4.441261 2.41914 -0.463827
H  -5.974595 -0.178469 2.813537
