program: Gaussian 09
title: 000171230
version: EM64L-G09RevD.01
frameworkgroup: C1[X(C16H19N5O8)]
method: RPBEPBE
basis: SDD
operation: Freq
keyword: #p
keyword: freq=noraman
keyword: PBEPBE/SDD
title: #p freq=noraman PBEPBE/SDD
converged: YES YES NO NO
title: Mulliken charges:
elementType: O O O O O O O O N N N N N C C C C C C C C C C C C C C C C H H H H H H H H H H H H H H H H H H H
charge: -0.286283 -0.438594 -0.280917 -0.246000 -0.299226 -0.188922 -0.239896 -0.220631 -0.181981 -0.146571 -0.398238 -0.062423 -0.069204 -0.041265 -0.131727 -0.562462 0.034134 -0.439601 -0.243651 0.203829 0.178579 0.234626 0.086887 -0.044676 -0.768491 0.225698 0.220179 -0.493004 -0.496600 0.314910 0.220626 0.292737 0.239776 0.283790 0.254806 0.250754 0.348643 0.330716 0.356924 0.237972 0.240352 0.243647 0.241874 0.246593 0.259803 0.247006 0.240167 0.245335
chargesum: 0.00000
title: Mulliken charges with hydrogens summed into heavy atoms:
elementType: O O O O O O O O N N N N N C C C C C C C C C C C C C C C C
charge: -0.286283 -0.089951 -0.280917 -0.246000 -0.299226 -0.188922 -0.239896 -0.220631 -0.181981 -0.146571 -0.041314 -0.062423 -0.069204 0.273646 0.088899 -0.029950 0.317924 0.065959 0.087065 0.203829 0.178579 0.234626 0.086887 -0.044676 -0.046520 0.225698 0.220179 0.255266 0.235908
polarizability: 2.81683391e+02 2.99332939e+00 2.94856481e+02 -6.85579744e+00 -1.34517100e+01 1.44902994e+02
1716.lowfreq: -7.2628 -3.3820 -2.0262 -0.0010 -0.0007 -0.0003 9.7479 20.8505 23.2971
frequency: 9.1979 20.7946 23.2768 28.8514 39.6763 51.9569 56.5719 63.7432 96.5813 97.4207 100.5630 106.9088 110.5659 116.2453 124.6041 127.8587 149.2335 159.0909 176.3084 176.6943 202.8288 235.5633 238.9643 252.3975 277.7105 279.7317 285.9567 300.1573 306.9632 313.3001 338.4079 355.8584 367.8521 378.9888 386.7166 423.7670 445.8583 467.2490 477.1419 514.7815 542.0760 550.9161 597.2226 625.9710 635.8265 656.2665 702.0592 707.4364 716.0725 719.0373 731.6872 736.5413 750.1275 762.3676 767.0692 777.6878 784.7674 816.3283 850.3371 873.2037 890.0305 908.0342 916.9371 927.9643 941.0993 956.4304 996.7839 1013.6392 1019.0532 1037.2431 1042.5222 1054.9645 1065.1142 1066.2110 1092.2290 1110.5372 1113.3685 1114.3277 1131.7532 1142.9274 1149.8804 1154.9798 1159.8144 1178.6227 1183.7803 1208.7309 1231.7296 1247.6064 1259.9029 1276.9144 1284.2168 1293.4986 1314.5615 1320.1092 1330.9876 1340.1022 1351.2814 1366.9623 1377.4868 1381.1156 1406.4437 1412.5578 1416.8305 1420.0054 1429.1068 1446.7243 1452.3364 1453.2699 1455.3683 1461.1390 1461.8425 1463.3739 1471.8508 1526.9165 1613.4208 1627.4251 1629.8839 1650.9653 1657.9991 2977.4067 2987.3902 3007.3599 3011.0181 3022.2826 3037.0135 3052.4225 3065.8824 3083.4248 3098.7918 3102.0100 3109.3674 3110.2264 3117.4542 3157.3274 3157.3889 3160.3220 3526.2785 3566.0521
redmass: 7.2777 5.6634 5.9846 5.8017 6.4468 5.9092 5.7638 6.7718 1.8359 3.1339 3.9245 1.2861 2.9382 2.1777 2.4053 1.3648 5.5150 5.0273 4.8851 7.4296 4.7727 5.5515 5.4123 4.5104 5.0515 3.7877 4.3896 2.2136 2.1138 5.3906 5.2191 4.5418 4.1696 8.5675 4.5241 3.4977 3.4689 5.9320 7.5837 3.5746 4.0536 6.2146 6.0389 9.0430 4.3288 11.2020 2.2826 6.9388 4.6527 7.3742 6.1716 6.2999 6.2957 5.7363 9.0772 2.3226 7.7040 3.8448 3.0363 3.0496 6.7998 8.9883 5.3241 2.8913 1.3216 2.4016 2.5782 8.4617 1.7910 4.8807 2.6411 1.4605 4.0288 2.7641 3.4668 3.0119 1.2662 1.2636 5.2509 2.3473 1.4513 2.4104 1.6043 6.6491 1.3013 9.5211 4.0848 1.3360 1.8087 1.5008 1.4020 1.3647 1.6199 5.2075 1.3353 1.8432 1.3556 1.7277 1.6345 1.7858 1.2582 1.8655 2.8469 1.1893 1.3537 1.4951 1.0515 1.0502 1.0448 1.0529 1.0942 1.0533 1.0806 9.2262 5.5464 10.8308 10.6988 10.9256 5.8953 1.0848 1.0365 1.0296 1.0292 1.0650 1.0589 1.0862 1.0973 1.0878 1.1019 1.1007 1.1041 1.1047 1.1050 1.1049 1.1056 1.0957 1.0770 1.0662
irintensity: 0.7952 0.4567 2.3387 0.4668 3.5682 0.6736 3.1818 1.6641 1.1787 1.2761 1.7769 0.2684 1.1789 0.5152 0.0393 1.8299 0.4837 4.6457 1.3223 4.2414 5.7402 6.1088 7.7389 5.8783 20.0614 1.1034 27.2098 58.4350 71.9050 22.9589 1.4025 4.2058 24.3552 12.7781 2.8261 5.8965 3.1089 14.4216 0.6603 21.5055 13.7356 1.6858 4.4702 3.8578 3.8224 4.7686 9.7350 8.7867 10.7759 4.2613 0.7130 10.6453 19.1155 4.1173 11.4797 106.8412 10.9416 10.3923 9.5748 16.7744 4.6775 7.8060 23.4331 49.7651 15.8593 15.4901 6.2639 103.5988 28.5113 195.8529 139.5030 7.4569 38.2486 110.3654 9.9304 37.9413 0.0988 0.6252 9.9230 75.0736 32.6313 157.1627 72.9205 48.4540 25.5652 82.7153 11.2762 5.5380 113.1641 38.5282 121.5008 3.4158 18.4091 129.8258 5.7435 46.0404 5.8721 20.5554 16.3372 9.7649 24.8947 42.2433 89.8552 17.7610 66.0190 40.2067 15.9386 15.4163 12.9754 8.3606 19.0168 9.0388 2.9403 13.1823 174.6880 339.0918 111.7272 284.7565 536.2136 44.4437 17.9212 32.2530 25.5914 10.7759 18.6338 6.3411 14.7704 1.6386 9.8425 10.8352 7.3608 22.0667 16.2882 17.3871 4.5019 94.0187 58.8285 9.5170
temp: 298.150 k
press: 1.00000 atm
elementType: 8 8 8 8 8 8 8 8 7 7 7 7 7 6 6 6 6 6 6 6 6 6 6 6 6 6 6 6 6 1 1 1 1 1 1 1 1 1 1 1 1 1 1 1 1 1 1 1
symmnumber: 1
zpe: 937571.2 jmol-1
zpe.correction: 0.357102 hartree
zpe.thermalcorrener: 0.385931 hartree
zpe.thermalcorrenthalpy: 0.386875 hartree
zpe.thermalcorrgfe: 0.293369 hartree
zpe.sumelectzpe: -1494.465797 hartree
zpe.sumelectthermal: -1494.436969 hartree
zpe.sumelectthermalent: -1494.436024 hartree
zpe.sumelectthermalfe: -1494.529531 hartree
dipole: 3.6716 6.9882 3.6446
dipole: 8.6947
quadrupole: -193.7138 -149.4437 -168.7741
quadrupole: -17.5877 -3.1964 13.2536
quadrupole: -23.0700 21.2002 1.8698 -17.5877 -3.1964 13.2536
hfenergy: -1494.8228995 hartree
pointgroup: C01[X(C16H19N5O8)]
dipole: -1.4909031 -2.7828961 1.3169575 debye
polarizability: 281.9063913|3.06735|293.1763787|6.3160118|20.1630149|146.3600965 unknown
InChI: InChI=1S/C16H19N5O8/c1-7-5-20(16(26)17-13(7)23)10-4-8(22)9(29-10)6-21-12(15(25)28-3)11(18-19-21)14(24)27-2/h5,8-10,17,22H,4,6H2,1-3H3
charge 0 multiplicity 1
48 atoms
O  0.910738 -1.183254 -0.583714
O  1.052625 -4.324795 -0.57019
O  5.006746 -1.440024 -1.117584
O  5.504337 2.996254 0.296101
O  -3.049629 -2.537423 -0.015918
O  -4.898851 -1.143963 0.299839
O  -4.124597 3.123173 0.305833
O  -4.592867 1.485727 -1.291548
N  3.124253 -0.308216 -0.280083
N  -1.381868 -0.403509 0.979158
N  5.198039 0.795257 -0.418302
N  -0.761936 0.847847 1.155943
N  -1.635605 1.787967 0.745398
C  0.106472 -2.222191 0.104076
C  1.094511 -3.337879 0.517355
C  2.447921 -2.600663 0.600244
C  2.332967 -1.542978 -0.522905
C  -0.611853 -1.605515 1.327372
C  2.563499 0.84558 0.281633
C  4.486346 -0.385961 -0.644849
C  -2.65618 -0.240315 0.461807
C  3.290482 1.992492 0.508777
C  4.715086 2.017973 0.148033
C  -2.805003 1.158226 0.321549
C  2.680056 3.240972 1.096951
C  -3.662495 -1.304728 0.247694
C  -3.927516 1.898066 -0.3142
C  -3.983782 -3.663748 -0.283229
C  -5.17881 3.974665 -0.300433
H  -0.629924 -2.608745 -0.617822
H  0.815747 -3.811038 1.481375
H  3.318845 -3.258299 0.447653
H  2.55603 -2.098804 1.579475
H  2.663062 -1.953708 -1.492335
H  0.118613 -1.284875 2.08912
H  -1.293815 -2.355908 1.758864
H  1.791947 -4.974428 -0.456958
H  1.495468 0.785101 0.506226
H  6.189362 0.774646 -0.678143
H  3.203653 3.533744 2.025241
H  1.609421 3.095853 1.317949
H  2.785721 4.091769 0.399399
H  -3.331691 -4.520072 -0.50256
H  -4.614341 -3.852138 0.601499
H  -4.625515 -3.417475 -1.144533
H  -6.147418 3.447679 -0.285228
H  -5.201811 4.87505 0.327869
H  -4.91344 4.220513 -1.342296
