program: Gaussian 09
title: 000171197
version: EM64L-G09RevD.01
frameworkgroup: C1[X(C20H16O8)]
method: RPBEPBE
basis: SDD
operation: Freq
keyword: #pfreq=noraman
keyword: PBEPBE/SDD
title: #p freq=noraman PBEPBE/SDD
converged: YES YES NO NO
title: Mulliken charges:
elementType: O O O O O O O O C C C C C C C C C C C C C C C C C C C C H H H H H H H H H H H H H H H H
charge: -0.438613 -0.466749 -0.352917 -0.349524 -0.189732 -0.286338 -0.161969 -0.392430 0.158134 -0.556973 -0.658048 -0.228911 0.180701 0.074121 -0.114140 -0.073243 0.186176 0.186917 0.235807 -0.001686 -0.236964 -0.794590 0.009758 0.327408 0.138060 -0.427293 -0.359274 -0.191060 0.249138 0.229898 0.280557 0.250878 0.328773 0.354742 0.355466 0.263837 0.256374 0.264071 0.372168 0.401665 0.290955 0.260712 0.237271 0.386869
chargesum: 0.00000
title: Mulliken charges with hydrogens summed into heavy atoms:
elementType: O O O O O O O O C C C C C C C C C C C C C C C C C C C C
charge: -0.083871 -0.111284 0.019252 0.052141 -0.189732 -0.286338 -0.161969 -0.005561 0.158134 -0.077937 -0.126613 0.099861 0.180701 0.074121 -0.114140 -0.073243 0.186176 0.186917 0.235807 -0.001686 -0.236964 -0.010308 0.009758 0.327408 0.138060 -0.136338 -0.098563 0.046211
polarizability: 4.22619281e+02 -8.35935444e+00 2.67463822e+02 2.35136869e+01 9.95453710e+00 1.34953636e+02
1716.lowfreq: -2.8430 0.0001 0.0007 0.0009 8.7170 10.8642 22.4210 28.6277 37.5174
frequency: 22.3150 28.5956 37.5012 49.2731 74.6056 83.7001 114.8129 126.3783 133.9071 171.2380 177.2597 188.8434 213.9938 228.1697 243.8723 246.2190 256.8299 271.8605 285.8206 302.7718 316.3207 339.0522 349.3606 358.6858 367.9179 379.7969 390.8779 400.5424 420.3871 428.8267 436.9980 445.1313 455.9043 467.4191 471.9170 489.9875 505.2327 519.0942 532.3022 547.2404 555.6192 577.2398 599.2493 612.1794 659.3769 673.1999 678.8981 705.5424 708.7946 740.7762 762.4961 775.4219 812.1695 833.7493 856.8860 870.3834 890.4451 902.4475 916.7545 928.7828 932.9421 953.1325 974.7227 976.5072 981.6991 996.8669 1008.3304 1026.3620 1029.4077 1054.3876 1073.0838 1100.9409 1105.9761 1130.9766 1160.8535 1166.5617 1177.1889 1189.9866 1209.8829 1214.2339 1265.2087 1268.0072 1277.4736 1293.8946 1299.8217 1309.4136 1315.6205 1331.6965 1335.2150 1349.6924 1362.0242 1370.6128 1371.5336 1400.7390 1406.5227 1420.1003 1439.3562 1440.8066 1446.6559 1450.6621 1460.4301 1462.8752 1472.4892 1528.2126 1544.8092 1578.8136 1588.1080 1594.3861 1618.3722 1627.6160 2653.7846 2966.0030 2983.9967 2992.7348 3022.3332 3048.1174 3074.2780 3075.6417 3104.1711 3124.9599 3143.0214 3169.3106 3178.9382 3533.2191 3543.8666 3546.5078
redmass: 7.3173 6.6439 5.9729 5.0893 6.5202 6.5004 8.6660 6.5162 6.3639 6.5803 1.0965 6.6468 4.8672 4.1713 3.8835 3.9987 2.8566 2.4836 5.7392 5.2438 3.5038 4.1637 7.9535 3.2173 2.4078 1.6001 3.1873 6.2043 1.7238 8.5791 3.0077 6.5260 8.4305 4.0219 6.0978 5.1855 3.5885 4.6342 5.3836 5.8095 5.0241 5.6021 3.6843 4.0967 6.0986 4.5705 4.8012 4.5177 3.4204 5.5217 7.2587 3.4730 2.1176 5.7727 2.3649 4.7101 3.9535 1.9238 6.3251 1.8172 1.5465 2.6219 1.0751 2.2638 4.1159 1.3605 3.5296 2.2325 2.6251 2.3517 2.2606 3.0233 2.1450 2.1989 1.2577 1.3130 1.7748 1.6560 1.6200 1.9795 2.3594 2.3225 2.8480 3.2649 3.5322 2.4164 1.9534 1.7569 1.7207 1.6126 1.3710 2.7721 1.2884 5.3708 7.3316 6.4382 1.6968 1.4319 1.0957 3.7297 1.1563 1.9324 1.1247 5.8604 4.3511 4.3333 6.9627 5.9239 8.8966 5.9994 1.0713 1.0611 1.0398 1.0629 1.0973 1.0843 1.0996 1.0921 1.0674 1.1013 1.0879 1.0922 1.0981 1.0650 1.0662 1.0659
irintensity: 1.9267 0.1400 5.2501 6.0859 0.5131 0.2867 0.9823 6.3457 1.4616 2.2275 0.9334 4.9486 2.2737 13.3110 6.5517 4.7556 31.0572 21.8761 4.1331 16.0741 24.0687 7.3891 6.2293 4.2857 52.6176 102.3008 8.8381 21.0358 157.4105 4.9160 16.9872 9.2222 3.7769 34.5989 24.7262 4.7210 2.2653 19.3655 5.4548 7.8790 8.5513 2.8824 1.0367 3.7172 1.0778 4.7631 3.2435 9.1475 1.9008 18.7669 7.5368 35.8818 34.7971 10.7540 113.1992 10.3352 12.5655 69.4715 74.4805 46.3347 0.1368 38.5122 110.9453 42.8581 41.1998 1.5824 52.8886 23.1732 69.5883 8.9452 34.2570 59.4912 90.3448 14.6915 28.4381 28.3255 23.0735 65.1170 110.2850 44.8766 179.6231 272.3038 191.5000 44.4173 256.4204 6.6531 69.8344 73.3410 11.3770 49.4519 61.3060 97.8921 41.6475 47.5928 46.7442 42.0567 50.6745 4.4885 26.7667 192.6697 2.3945 82.5761 5.3481 137.5027 87.8311 103.8913 5.2808 23.6444 80.7682 51.3603 232.7606 6.7847 1.0179 17.0088 9.8132 1.2976 17.9469 6.4661 646.4666 7.9866 12.8517 0.5344 17.0623 34.6287 14.7552 14.2555
temp: 298.150 k
press: 1.00000 atm
elementType: 8 8 8 8 8 8 8 8 6 6 6 6 6 6 6 6 6 6 6 6 6 6 6 6 6 6 6 6 1 1 1 1 1 1 1 1 1 1 1 1 1 1 1 1
symmnumber: 1
zpe: 844548.4 jmol-1
zpe.correction: 0.321672 hartree
zpe.thermalcorrener: 0.345745 hartree
zpe.thermalcorrenthalpy: 0.346689 hartree
zpe.thermalcorrgfe: 0.268383 hartree
zpe.sumelectzpe: -1371.535798 hartree
zpe.sumelectthermal: -1371.511725 hartree
zpe.sumelectthermalent: -1371.510781 hartree
zpe.sumelectthermalfe: -1371.589086 hartree
dipole: -7.2978 -2.2817 -2.8512
dipole: 8.1605
quadrupole: -137.9296 -179.7985 -158.0335
quadrupole: -3.5937 6.7638 -10.9694
quadrupole: 20.6576 -21.2113 0.5537 -3.5937 6.7638 -10.9694
hfenergy: -1371.8574696 hartree
pointgroup: C01 [X(C20H16O8)]
dipole: -2.8500051 0.9183484 1.1584163 debye
polarizability: 421.6177813|8.0821988|267.8006735|-29.0977791|7.2487345|135.6182851 unknown
InChI: InChI=1S/C20H16O8/c1-7(21)20(28)5-9-13(11(23)6-20)19(27)15-14(17(9)25)16(24)8-3-2-4-10(22)12(8)18(15)26/h2-4,11,22-23,25,27-28H,5-6H2,1H3
charge 0 multiplicity 1
44 atoms
O  -5.515249 1.051472 0.755418
O  -2.624124 -2.962803 1.200129
O  -0.723319 2.782678 0.726946
O  -0.25195 -2.773505 0.106289
O  -4.635598 -0.784255 -1.8976
O  2.290954 -2.449045 -0.383662
O  1.796923 3.019204 0.168744
O  4.776133 -2.245787 -0.615448
C  -4.304722 0.364162 0.241122
C  -4.170607 -1.04571 0.840586
C  -3.13714 1.24808 0.71412
C  -2.870028 -1.726314 0.386368
C  -1.776284 0.584613 0.543844
C  -1.648187 -0.810298 0.410475
C  -0.60791 1.406732 0.508467
C  -0.355393 -1.400299 0.205565
C  -4.456693 0.318854 -1.31587
C  0.677016 0.856191 0.234522
C  0.804565 -0.574713 0.07693
C  2.136719 -1.175073 -0.189161
C  1.879023 1.751461 0.121125
C  -4.449013 1.637648 -2.065129
C  3.320715 -0.307801 -0.225647
C  3.213727 1.103539 -0.068897
C  4.618777 -0.895262 -0.439189
C  4.365362 1.915617 -0.111053
C  5.771393 -0.065704 -0.470762
C  5.638236 1.324445 -0.306273
H  -5.020705 -1.681659 0.536883
H  -4.181359 -0.940653 1.944145
H  -3.339623 1.479339 1.780562
H  -3.185588 2.208785 0.16625
H  -3.005709 -2.13972 -0.62807
H  -6.310234 0.481853 0.585044
H  -2.583565 -2.723119 2.162069
H  -4.959201 2.429241 -1.490223
H  -3.403712 1.962464 -2.237072
H  -4.928472 1.50952 -3.047973
H  -1.629885 3.013396 1.056126
H  -1.098966 -3.191559 0.480018
H  4.244734 2.996103 0.006015
H  6.744881 -0.538464 -0.629067
H  6.532403 1.956423 -0.33394
H  3.816777 -2.656375 -0.571027
