program: Gaussian 09
title: 000171071
version: EM64L-G09RevD.01
frameworkgroup: C1[X(C13H24N4O)]
method: RPBEPBE
basis: SDD
operation: Freq
keyword: #p
keyword: freq=noraman
keyword: PBEPBE/SDD
title: #p freq=noraman PBEPBE/SDD
converged: YES YES NO NO
title: Mulliken charges:
elementType: O N N N N C C C C C C C C C C C C C H H H H H H H H H H H H H H H H H H H H H H H H
charge: -0.466038 -0.285175 -0.308184 -0.292044 -0.581947 -0.376662 -0.373150 -0.362471 -0.372643 -0.479912 -0.329916 0.390299 -0.387985 0.155416 -0.412351 -0.392953 -0.249176 -0.209445 0.165247 0.229663 0.194695 0.202638 0.159639 0.224182 0.194452 0.204035 0.236316 0.285966 0.195616 0.213276 0.236037 0.165296 0.229704 0.167432 0.227584 0.234856 0.215551 0.227587 0.227223 0.277908 0.261528 0.357906
chargesum: 0.00000
title: Mulliken charges with hydrogens summed into heavy atoms:
elementType: O N N N N C C C C C C C C C C C C C
charge: -0.108132 -0.048859 -0.022218 -0.056007 -0.042510 0.018247 0.024183 0.021350 0.025844 -0.071019 0.065084 0.390299 0.007031 0.155416 -0.177495 -0.177402 -0.021589 0.017777
polarizability: 2.41496780e+02 -9.06867169e-01 1.60531921e+02 -2.12982166e+01 1.39142572e+00 1.23720252e+02
1716.lowfreq: -10.4786 -3.4902 -2.1259 -0.0009 0.0010 0.0012 12.3187 22.5153 27.7876
frequency: 12.1931 22.5092 27.7579 34.1238 53.7503 66.2698 76.2694 97.5926 111.1534 125.4794 141.3795 151.2967 155.7504 167.0312 183.6460 222.1741 233.3092 269.4305 298.5871 310.2579 366.6032 382.4812 421.4273 433.7078 459.1021 487.8638 523.5643 530.7288 557.8741 586.0328 611.4175 689.0420 698.0818 714.5645 743.5436 751.3201 757.4244 804.3802 815.2683 825.5418 834.3669 850.7577 926.3101 954.2589 964.4005 974.3278 990.5691 1016.5634 1023.4509 1038.2290 1047.5247 1069.2933 1076.4163 1083.8522 1106.9324 1118.0402 1131.0881 1136.7287 1146.2109 1150.9015 1157.0873 1161.1723 1171.1857 1196.4426 1215.6160 1217.0321 1235.8261 1246.4875 1250.0334 1266.5612 1271.1816 1280.0962 1289.0650 1300.6283 1312.1193 1334.5215 1355.9356 1377.9343 1393.2942 1397.0502 1405.8138 1438.9496 1444.7814 1455.8065 1462.3109 1474.2321 1476.8111 1481.2978 1487.3542 1491.7628 1494.7765 1496.2173 1499.1662 1603.2240 1618.1320 1637.6881 2810.3455 2831.0947 2831.8239 2845.4551 2846.8832 2881.1796 2895.7930 2973.7039 2998.7975 3012.9893 3016.6110 3029.0028 3034.2852 3051.6005 3110.5455 3128.5398 3143.8139 3166.7494 3415.5065 3417.6670 3424.3075 3469.5148 3582.5929 3598.3388
redmass: 4.4176 4.7099 1.9304 4.3996 3.5883 3.5164 2.1655 3.1477 2.6539 2.3064 2.6163 4.5610 2.8097 2.3048 3.3019 1.2521 3.8278 2.8784 3.4708 4.3858 1.1617 3.4496 3.8593 3.3407 3.5499 3.0224 4.2257 4.2236 4.7129 1.3363 4.7466 1.2489 1.3471 2.7255 1.9292 1.4016 2.2520 1.1032 1.1234 1.1456 1.8748 2.5086 1.4089 1.6298 1.5947 1.4219 3.0006 2.4139 2.6505 2.2941 2.4497 2.3705 1.8947 2.0911 2.8113 1.9344 3.2933 1.5448 3.2447 1.3020 3.8096 1.3275 1.0643 1.6192 1.9976 1.5351 2.4365 1.3941 1.3113 1.1364 1.1088 1.0807 1.2059 1.3223 1.2817 1.3134 1.3662 1.4605 4.3080 1.7122 1.5451 2.3121 1.2492 1.2012 1.1860 1.1176 1.0752 1.0829 1.0901 1.1335 1.5270 1.4134 1.0862 6.4388 6.9240 1.0956 1.0718 1.0718 1.0718 1.0707 1.0719 1.0692 1.0669 1.0872 1.0951 1.0868 1.0830 1.0846 1.0902 1.0907 1.0886 1.0879 1.0927 1.1004 1.0736 1.0735 1.0737 1.0449 1.0659 1.0980
irintensity: 0.3829 0.0447 2.1200 0.3904 1.7250 1.6662 6.6855 0.6928 0.5145 0.2233 4.4238 0.8702 1.9840 7.2165 3.7593 45.4193 8.6329 8.4557 6.3811 5.0371 113.3311 6.4345 5.1826 0.0878 8.9612 16.1483 12.2290 6.1040 7.9907 244.6688 9.3298 16.6039 179.1948 27.1796 30.3786 55.3537 85.4707 2.9857 0.8648 1.0792 7.6234 11.7055 2.0579 2.0004 2.1141 1.6974 4.6971 2.6465 2.8624 3.5798 1.1959 44.2445 32.4139 10.5822 39.6208 118.5024 25.9872 4.6610 2.9649 31.8828 140.5584 24.5008 0.7990 1.3153 8.6421 14.8079 29.2652 21.0400 2.6803 0.7422 0.9417 12.9112 5.6308 15.3413 3.2081 8.8078 0.5213 3.4772 3.2507 5.2637 1.1334 43.4514 0.4827 108.6315 61.6153 3.3077 3.0194 0.4965 0.8539 6.3568 7.5309 8.5311 4.5339 17.3570 5.1774 45.7886 149.3651 239.1581 7.5453 109.0949 114.0737 0.9572 195.2487 0.0319 82.4885 28.1908 24.9305 24.2010 49.3386 50.0933 14.4593 3.9595 23.7694 24.8486 2.7741 2.6937 6.3662 0.6810 28.0464 0.5565
temp: 298.150 k
press: 1.00000 atm
elementType: 8 7 7 7 7 6 6 6 6 6 6 6 6 6 6 6 6 6 1 1 1 1 1 1 1 1 1 1 1 1 1 1 1 1 1 1 1 1 1 1 1 1
symmnumber: 1
zpe: 953871.7 jmol-1
zpe.correction: 0.363311 hartree
zpe.thermalcorrener: 0.384235 hartree
zpe.thermalcorrenthalpy: 0.385179 hartree
zpe.thermalcorrgfe: 0.309510 hartree
zpe.sumelectzpe: -802.525493 hartree
zpe.sumelectthermal: -802.504569 hartree
zpe.sumelectthermalent: -802.503625 hartree
zpe.sumelectthermalfe: -802.579293 hartree
dipole: 0.7695 1.3870 -0.4652
dipole: 1.6530
quadrupole: -84.8943 -100.2264 -112.5373
quadrupole: 13.3542 10.6719 1.6277
quadrupole: 14.3251 -1.0071 -13.3179 13.3542 10.6719 1.6277
hfenergy: -802.8888034 hartree
pointgroup: C01 [X(C13H24N4O1)]
dipole: -0.3048326 0.3411524 0.462206 debye
polarizability: 241.3840219|13.395973|149.9137805|-16.958389|16.7191591|134.4511512 unknown
InChI: InChI=1S/C13H24N4O/c14-5-6-15-7-8-16-9-10-17-11-12-3-1-2-4-13(12)18/h1-4,15-18H,5-11,14H2
charge 0 multiplicity 1
42 atoms
O  -3.612538 1.915969 0.443005
N  2.076003 -0.11952 -0.559624
N  -1.68592 -0.232914 -0.219979
N  5.724235 -0.060307 0.451724
N  9.478344 0.214171 0.131765
C  0.767266 -0.202675 0.121695
C  3.243429 -0.102034 0.34744
C  -0.377474 -0.248921 -0.905712
C  4.557524 -0.098885 -0.455808
C  -2.837948 -0.289692 -1.155103
C  7.033928 0.046829 -0.223142
C  -4.174108 -0.260827 -0.431576
C  8.170409 0.168039 0.810559
C  -4.551558 0.859905 0.355761
C  -5.097207 -1.327135 -0.527126
C  -5.797419 0.91828 1.019028
C  -6.352725 -1.288458 0.124698
C  -6.701838 -0.160814 0.899727
H  0.589361 0.651501 0.827868
H  0.740233 -1.125893 0.729718
H  3.197032 -1.016876 0.974086
H  3.254449 0.7681 1.048091
H  -0.255633 0.603026 -1.629314
H  -0.290712 -1.179712 -1.497372
H  4.596436 0.809979 -1.091545
H  4.55405 -0.975561 -1.148035
H  2.101888 0.677648 -1.212747
H  -1.777228 0.594579 0.388383
H  -2.81139 0.551215 -1.895535
H  -2.763445 -1.229388 -1.734776
H  5.708565 -0.85157 1.112092
H  7.249577 -0.819354 -0.903527
H  7.037377 0.953305 -0.856028
H  8.071471 -0.668259 1.550084
H  8.028348 1.10729 1.37418
H  -4.821326 -2.205142 -1.122917
H  -6.061637 1.796144 1.623867
H  -7.046733 -2.129953 0.030221
H  -7.668633 -0.117407 1.412804
H  10.251363 0.555486 0.70834
H  9.720565 -0.6398 -0.379259
H  -3.977182 2.66493 0.976087
