program: Gaussian 09
title: 000171070
version: EM64L-G09RevD.01
frameworkgroup: C1[X(C18H14O5)]
method: RPBEPBE
basis: SDD
operation: Freq
keyword: #pfreq=noraman
keyword: PBEPBE/SDD
title: #p freq=noraman PBEPBE/SDD
converged: YES YES NO NO
title: Mulliken charges:
elementType: O O O O O C C C C C C C C C C C C C C C C C C H H H H H H H H H H H H H H
charge: -0.445803 -0.283790 -0.413175 -0.210800 -0.196317 0.092579 -0.041368 0.522600 0.532463 0.064363 -0.807927 0.279798 0.338617 -0.486301 -0.477227 -0.387624 -0.366494 -0.220868 -0.231893 0.277850 0.288041 -0.757408 -0.767158 0.247870 0.247442 0.248900 0.250505 0.300067 0.231735 0.234103 0.412258 0.247569 0.239915 0.256443 0.260588 0.264660 0.255786
chargesum: 0.00000
title: Mulliken charges with hydrogens summed into heavy atoms:
elementType: O O O O O C C C C C C C C C C C C C C C C C C
charge: -0.033544 -0.283790 -0.413175 -0.210800 -0.196317 0.092579 -0.041368 0.522600 0.532463 0.064363 -0.560057 0.279798 0.338617 -0.238859 -0.228328 -0.137119 -0.066427 0.010867 0.002210 0.277850 0.288041 -0.013480 0.013875
polarizability: 3.38892388e+02 -2.33100248e+00 2.67552146e+02 -1.17676164e+01 -1.11725535e+01 1.03164729e+02
1716.lowfreq: -9.7288 -4.9759 -0.0004 0.0002 0.0007 1.5694 18.8568 32.9368 47.3689
frequency: 18.8333 32.9328 47.3617 67.5468 72.4226 79.5788 92.5043 100.6820 110.8678 114.8116 152.9315 207.1640 218.4062 250.8917 258.1201 294.5278 302.8369 312.0372 331.1873 338.0991 394.5994 432.9202 457.1983 484.7179 497.2576 501.9199 519.9255 542.8143 545.4116 552.8993 570.5271 584.1291 593.7835 625.3589 637.2925 657.6377 685.6655 711.0365 733.0238 744.8400 758.8530 772.6901 804.4382 815.8717 836.6519 845.9373 885.5643 901.2385 907.8352 929.6000 978.3653 982.5670 983.2356 983.7904 1016.2051 1020.3204 1034.9635 1038.6881 1061.1042 1072.0935 1106.3751 1142.1212 1162.5261 1176.2285 1178.9948 1186.0761 1217.2561 1230.3901 1296.2419 1311.6468 1351.7142 1363.5762 1375.2339 1385.7374 1408.1878 1421.2379 1425.8353 1435.8134 1445.4969 1450.8312 1453.6239 1457.2726 1459.0140 1476.9137 1561.9650 1566.9720 1590.3999 1626.6886 1635.8358 1683.7809 1684.4031 3003.2933 3008.7153 3090.5920 3099.2804 3131.6241 3134.0610 3136.5348 3142.3251 3143.4708 3153.9183 3161.4865 3173.7775 3217.7941 3264.3996
redmass: 6.9643 5.1715 4.3410 2.0929 1.9096 2.3134 2.4982 1.5322 4.8007 5.1363 8.8277 4.4299 6.9988 7.3320 5.3805 4.2358 4.1788 5.8715 4.1209 5.5258 6.0049 6.5962 5.7219 4.7133 3.6536 4.9552 5.1889 3.4725 3.3367 5.8612 5.3258 5.0256 3.9463 3.8470 6.3627 5.4608 5.6441 1.1921 2.4449 4.3268 4.2648 1.4881 2.1895 2.2149 6.4415 5.0889 1.7346 5.2596 1.4709 1.6881 1.3532 1.9363 1.4918 2.2621 4.6974 4.1766 1.6899 1.6236 4.4775 1.9044 2.7558 3.1216 2.3086 1.5450 1.5467 1.4187 1.7919 2.0816 2.2410 2.0096 5.1375 2.7338 1.2601 1.2284 2.8632 3.8267 3.2605 3.6179 1.8209 1.0566 1.0750 1.0470 1.2091 3.4061 4.8188 7.0525 4.7948 6.7561 6.3377 10.3365 10.1325 1.0375 1.0361 1.0979 1.0971 1.0876 1.0886 1.0894 1.1016 1.1000 1.0937 1.0973 1.0976 1.0939 1.0652
irintensity: 0.4793 0.7593 5.3546 2.7230 3.0462 0.9661 2.0626 0.8557 1.1812 1.1808 2.0101 0.1310 5.7547 0.7467 2.2467 2.2244 0.4558 0.4813 2.6403 4.6642 4.9529 0.4166 5.8672 2.8425 0.5950 14.9291 5.4752 4.3262 1.8310 1.7442 1.0491 1.5380 2.1465 11.0787 1.9277 3.0473 13.1490 69.6311 14.3708 3.7934 19.9190 104.9408 0.4318 7.9478 75.6648 58.4569 77.7274 1.9028 5.7629 10.2621 0.8857 22.8129 5.0108 51.2447 82.9679 220.7937 22.5855 10.0490 56.1066 40.2286 47.6339 324.5592 256.4299 155.7954 137.2238 8.7256 8.4137 1.8943 3.1765 150.2078 226.4646 2.2623 44.4259 45.5272 19.6124 14.1525 1.9990 3.9718 21.9520 17.6327 37.3052 16.8260 9.6872 9.4610 31.7924 66.2699 4.6936 30.5388 56.2202 160.9494 280.9663 0.7525 3.4361 4.5057 8.3836 0.2652 0.7549 7.0700 11.5088 12.1141 27.7271 30.6205 14.3072 2.2724 518.1769
temp: 298.150 k
press: 1.00000 atm
elementType: 8 8 8 8 8 6 6 6 6 6 6 6 6 6 6 6 6 6 6 6 6 6 6 1 1 1 1 1 1 1 1 1 1 1 1 1 1
symmnumber: 1
zpe: 721565.8 jmol-1
zpe.correction: 0.274830 hartree
zpe.thermalcorrener: 0.295209 hartree
zpe.thermalcorrenthalpy: 0.296154 hartree
zpe.thermalcorrgfe: 0.224176 hartree
zpe.sumelectzpe: -1068.847216 hartree
zpe.sumelectthermal: -1068.826836 hartree
zpe.sumelectthermalent: -1068.825892 hartree
zpe.sumelectthermalfe: -1068.897870 hartree
dipole: -0.7870 0.7798 -1.6800
dipole: 2.0125
quadrupole: -127.4033 -104.0937 -142.9659
quadrupole: -6.8349 -1.7735 -5.5426
quadrupole: -2.5824 20.7272 -18.1449 -6.8349 -1.7735 -5.5426
hfenergy: -1069.1220458 hartree
pointgroup: C01 [X(C18H14O5)]
dipole: 0.2561602 0.3386265 0.6682793 debye
polarizability: 334.4870365|16.8798816|270.4792459|-17.9931536|14.221712|104.642981 unknown
InChI: InChI=1S/C18H14O5/c1-10(19)22-14-7-3-5-12-9-13-6-4-8-15(23-11(2)20)17(13)18(21)16(12)14/h3-9,21H,1-2H3
charge 0 multiplicity 1
37 atoms
O  -0.202754 1.384156 0.49887
O  -2.874354 1.279495 0.633012
O  2.33088 1.45438 0.202369
O  -2.386472 1.871501 -1.584956
O  4.590678 2.084034 -0.058953
C  -1.383702 -0.703782 0.209731
C  1.110165 -0.637499 0.015634
C  -1.338475 -2.150305 0.007415
C  1.120124 -2.080608 -0.203029
C  -0.14814 0.018877 0.23474
C  -0.096031 -2.79552 -0.192769
C  -2.692363 -0.114797 0.388603
C  2.400929 0.026403 -0.008124
C  -2.558137 -2.915597 0.022358
C  2.372397 -2.759903 -0.418784
C  -3.851524 -0.88285 0.407673
C  3.600408 -0.646352 -0.217786
C  -3.786123 -2.300457 0.227748
C  3.572707 -2.06534 -0.424491
C  -2.617586 2.20702 -0.410596
C  3.407186 2.391608 0.150864
C  -2.706152 3.60678 0.146892
C  2.852465 3.777283 0.391842
H  -0.077071 -3.880681 -0.34356
H  -2.493564 -3.99864 -0.130253
H  2.353373 -3.84331 -0.580172
H  -4.810658 -0.377569 0.553409
H  4.545386 -0.105155 -0.232291
H  -4.710254 -2.887226 0.242715
H  4.519776 -2.588618 -0.589921
H  0.7324 1.748363 0.446298
H  -3.649124 3.742363 0.702911
H  -2.637976 4.341622 -0.668091
H  -1.87726 3.754876 0.860971
H  2.109019 4.034614 -0.383269
H  3.674548 4.50642 0.365852
H  2.347779 3.827613 1.372738
