program: Gaussian 09
title: 000171226
version: EM64L-G09RevD.01
frameworkgroup: C1[X(C20H26N2O8S2)]
method: RPBEPBE
basis: SDD
operation: Freq
keyword: #p
keyword: freq=noraman
keyword: PBEPBE/SDD
title: #p freq=noraman PBEPBE/SDD
converged: YES YES NO NO
title: Mulliken charges:
elementType: S S O O O O O O O O N N C C C C C C C C C C C C C C C C C C C C H H H H H H H H H H H H H H H H H H H H H H H H H H
charge: 0.089331 0.117229 -0.263078 -0.418617 -0.237173 -0.158965 -0.278095 -0.228700 -0.411401 -0.255479 -0.098549 -0.083678 0.203546 -0.151863 0.226213 -0.144543 -0.533389 -0.578532 -0.330968 0.006284 0.202135 -0.101280 0.307590 -0.305234 0.303369 -0.737515 -0.752399 -0.702351 -0.380366 -0.639397 0.291296 -0.764663 0.348325 0.286348 0.269349 0.267245 0.302273 0.257378 0.232251 0.358678 0.214392 0.244301 0.230286 0.224540 0.267991 0.233478 0.213375 0.245076 0.222447 0.221144 0.252811 0.240533 0.281550 0.252691 0.379584 0.260293 0.250554 0.252350
chargesum: 0.00000
title: Mulliken charges with hydrogens summed into heavy atoms:
elementType: S S O O O O O O O O N N C C C C C C C C C C C C C C C C C C C C
charge: 0.089331 0.117229 -0.263078 -0.059938 -0.237173 -0.158965 -0.278095 -0.228700 -0.031817 -0.255479 -0.098549 -0.083678 0.203546 0.196461 0.226213 0.141806 0.003204 -0.018881 -0.330968 0.006284 0.202135 0.130971 0.307590 -0.305234 0.303369 -0.048536 -0.026390 -0.021454 0.093589 0.135377 0.291296 -0.001465
polarizability: 3.29660983e+02 1.29462505e+01 2.88130058e+02 3.64427554e+00 4.51916438e+00 2.32264612e+02
1716.lowfreq: -28.5035 -8.4345 -0.0010 0.0009 0.0015 0.5795 4.9609 14.5224 24.7529
frequency: -28.3048 14.1931 24.7151 43.2118 52.9870 60.5269 72.4071 78.8279 84.2185 98.4515 99.4035 112.1425 124.7317 132.6483 143.7602 147.7461 172.6907 189.6638 193.7832 199.5058 201.0193 206.9051 217.8801 227.6150 237.5029 251.6877 261.6157 270.0173 273.2772 285.5914 289.0446 293.5566 305.7205 319.0604 321.3771 341.8533 345.6414 373.7026 381.1335 386.5074 394.5454 404.2896 420.2214 436.6111 457.1345 469.7848 477.7290 482.6943 515.2946 528.5906 534.4535 558.7408 562.1031 570.0366 602.3975 617.8006 624.7894 645.3633 661.5023 668.9528 703.5543 707.7468 710.1128 739.7650 743.1526 756.1472 773.2359 811.7064 837.8917 864.1393 867.7126 890.6202 901.6792 922.8872 927.4119 943.1836 963.4198 968.5307 988.9002 993.6301 997.8410 1007.0890 1009.3874 1019.2394 1023.9901 1031.7783 1037.9361 1042.7783 1056.6723 1073.2513 1084.3846 1088.7309 1100.2169 1110.5700 1118.7050 1132.4362 1152.2307 1163.1126 1176.5262 1194.4362 1202.8158 1209.1582 1211.6724 1220.1097 1240.6451 1246.1547 1251.4503 1264.9713 1278.9430 1286.2203 1296.1512 1301.2592 1311.3367 1324.3287 1334.9421 1336.3512 1338.4844 1361.8639 1374.4937 1383.8448 1385.2259 1385.8235 1396.4097 1403.8708 1426.8563 1450.7417 1452.2926 1453.6420 1453.7773 1456.7743 1459.7376 1465.3111 1471.8152 1478.0720 1478.5821 1481.7960 1492.5044 1494.7170 1598.9325 1623.5232 1629.3476 1658.1723 2963.1215 2981.3165 2986.9047 2990.1321 2990.9604 3007.2520 3008.5252 3015.6667 3034.3098 3038.7723 3081.3268 3082.0196 3083.5713 3084.8344 3087.6125 3092.9886 3095.9701 3096.6602 3096.9702 3098.2005 3108.4962 3119.0121 3121.5361 3145.5194 3402.9499 3530.8757
redmass: 1.1795 4.8275 6.1734 4.3737 3.9547 5.2871 4.7513 5.1456 6.0862 6.9690 5.5531 4.7539 7.6292 4.6388 10.7223 6.4703 4.8721 3.1616 2.2547 1.4006 1.7888 4.9877 3.9099 3.2312 2.2799 3.9119 1.3773 4.4334 1.2062 3.2596 2.9695 4.9226 2.2190 3.0819 4.0815 4.7405 5.4316 5.6924 5.8883 4.0864 4.7102 4.3210 7.7514 4.5993 3.0871 1.3602 6.3009 5.1725 3.7365 4.0334 4.7509 3.8833 4.7628 3.2550 6.3495 4.2135 5.3874 5.1088 1.5399 2.8477 4.3021 5.0724 4.0884 5.4248 4.7316 5.3641 5.5360 2.3436 4.5978 4.1084 3.7994 3.4430 2.9284 3.6227 3.0548 2.0876 1.8902 2.5420 1.6911 1.8111 2.0391 5.6040 2.4557 2.3195 3.2603 1.9242 2.1297 1.6743 2.7591 2.3421 4.2672 3.6035 2.3790 2.6574 1.3505 2.5347 2.2855 2.8735 2.4851 1.7940 1.9285 3.1268 1.9467 2.1945 2.5930 2.3815 2.0607 2.6356 1.7154 1.8471 1.5287 1.6071 2.3242 1.4692 1.5243 1.3081 1.4752 1.6841 1.1801 2.6828 1.2570 1.2718 1.1969 1.5826 1.2004 1.0670 1.0773 1.0504 1.0836 1.0799 1.0472 1.0548 1.0536 1.0642 1.0522 1.0536 1.0466 1.0573 9.5487 10.5971 8.7177 11.8439 1.0684 1.0340 1.0361 1.0357 1.0352 1.0797 1.0388 1.0688 1.0882 1.0619 1.1003 1.0981 1.0872 1.1014 1.0994 1.1005 1.0975 1.1007 1.1027 1.0993 1.0941 1.0989 1.0998 1.1010 1.0652 1.0654
irintensity: 2.0829 0.3689 0.4433 1.6572 0.5733 0.7567 2.2271 1.5082 0.8102 2.4496 10.7357 4.3573 4.2224 7.1224 3.0423 2.2699 1.0211 1.4192 0.7817 0.4936 2.9925 4.1769 2.0474 3.6270 0.6931 4.4926 1.8871 3.6604 0.5094 2.7877 7.3827 5.8721 0.9828 0.2727 0.2608 2.9522 6.2032 1.5549 21.2090 3.4235 35.4960 8.5896 7.3509 15.4467 6.8919 198.9602 22.0286 3.9133 16.6348 6.6145 5.5011 0.6403 9.9428 5.4786 26.1316 2.7935 8.3826 0.4427 174.3815 70.7001 10.7459 26.3860 5.9843 2.1595 6.8838 1.1839 7.5943 2.2642 3.9995 47.7286 10.9690 6.8903 0.5114 34.2555 3.1641 8.3482 7.5963 19.5121 17.9915 5.2890 104.6928 12.2656 64.5188 48.0398 53.5596 85.7939 10.4442 10.7632 20.6901 0.6805 24.6631 32.0319 16.5769 7.5439 1.0896 35.9085 24.7631 7.4690 9.6879 23.4312 23.2945 311.8894 84.5464 30.0381 3.0285 30.5178 38.8713 11.9225 9.0547 9.2767 26.7231 21.2070 164.2210 28.5408 27.0529 1.8983 15.1166 3.0637 7.4971 89.1853 34.1946 74.6855 22.2476 16.3948 50.9553 26.6746 21.0255 25.8615 10.7617 3.7581 4.2043 27.0927 7.9045 27.7227 1.5708 15.9845 22.2483 17.7494 233.1417 209.9961 206.1013 82.7871 33.1843 25.8587 5.7891 36.9870 36.6535 2.1053 1.3042 3.6899 17.4558 2.8432 3.9877 30.4146 3.1295 17.5054 45.0880 14.4122 0.7887 28.5873 3.4008 16.5632 13.2569 5.1435 0.3020 8.3809 62.0108 30.1779
temp: 298.150 k
press: 1.00000 atm
elementType: 16 16 8 8 8 8 8 8 8 8 7 7 6 6 6 6 6 6 6 6 6 6 6 6 6 6 6 6 6 6 6 6 1 1 1 1 1 1 1 1 1 1 1 1 1 1 1 1 1 1 1 1 1 1 1 1 1 1
symmnumber: 1
zpe: 1171292.0 jmol-1
zpe.correction: 0.446122 hartree
zpe.thermalcorrener: 0.477972 hartree
zpe.thermalcorrenthalpy: 0.478916 hartree
zpe.thermalcorrgfe: 0.383969 hartree
zpe.sumelectzpe: -2282.729354 hartree
zpe.sumelectthermal: -2282.697503 hartree
zpe.sumelectthermalent: -2282.696559 hartree
zpe.sumelectthermalfe: -2282.791506 hartree
dipole: 4.7457 0.4573 -2.0235
dipole: 5.1793
quadrupole: -166.8555 -211.5106 -216.5456
quadrupole: -5.1598 1.7972 -0.0680
quadrupole: 31.4484 -13.2067 -18.2417 -5.1598 1.7972 -0.0680
hfenergy: -2283.1754751 hartree
pointgroup: C01 [X(C20H26N2O8S2)]
dipole: -1.8308438 -0.246088 -0.8600241 debye
polarizability: 328.6830767|14.7138569|289.3074152|-0.1032527|-3.6167014|232.0651606 unknown
InChI: InChI=1S/C20H26N2O8S2/c1-9-16(3,4)12(25)18(30-9)6-11-17(28,13(18)29-10(2)24)7-19-14(26)21(5)20(8-23,32-31-19)15(27)22(11)19/h9,11,13,23,28H,6-8H2,1-5H3
charge 0 multiplicity 1
58 atoms
S  2.29516 -0.25369 2.294132
S  3.588741 1.557742 1.710247
O  -2.673228 0.715101 -1.321877
O  -0.372906 -1.93284 -1.772504
O  -2.80861 -1.830149 -0.285019
O  -2.887459 1.001075 2.257092
O  2.336474 2.134472 -1.536214
O  3.594969 -2.748383 0.119364
O  4.650925 3.208783 -0.447111
O  -1.607076 -3.776565 0.144156
N  1.643768 0.175239 -0.461263
N  4.330109 -0.530721 -0.16864
C  -0.287178 -1.231735 -0.49883
C  0.214411 0.211794 -0.80534
C  -2.048614 0.497436 -0.013267
C  -1.687751 -1.004375 0.199076
C  -0.646209 1.16225 0.065495
C  0.794868 -1.873262 0.43538
C  1.992678 -0.905785 0.432806
C  -3.058243 1.035736 1.017241
C  -4.298657 1.568398 0.275931
C  -3.767968 1.746196 -1.180603
C  2.576781 1.123908 -0.800468
C  3.95087 0.862275 -0.155283
C  3.358452 -1.511167 0.102129
C  -4.872622 2.826932 0.956004
C  -5.351006 0.41273 0.308462
C  -3.236876 3.138206 -1.550824
C  5.01652 1.828467 -0.716375
C  5.751961 -0.937363 -0.172027
C  -2.669192 -3.215441 -0.223269
C  -3.940227 -3.900016 -0.663693
H  0.082221 0.436972 -1.874986
H  -1.588475 -1.177147 1.288428
H  -0.292346 1.173522 1.113767
H  -0.652184 2.190988 -0.322321
H  1.129713 -2.852203 0.053471
H  0.411891 -2.042438 1.453783
H  -4.526154 1.428105 -1.91776
H  -0.456325 -2.903458 -1.581273
H  -5.80495 3.147184 0.456946
H  -5.101264 2.600658 2.012298
H  -4.162203 3.670742 0.941541
H  -6.269454 0.744141 -0.209922
H  -4.963532 -0.489457 -0.195678
H  -5.611272 0.157098 1.350875
H  -2.502589 3.517431 -0.817617
H  -2.746266 3.091189 -2.538029
H  -4.065704 3.867013 -1.610723
H  5.125976 1.633069 -1.804966
H  5.982829 1.673816 -0.214457
H  6.257941 -0.612071 -1.096042
H  5.772388 -2.03663 -0.118078
H  6.275455 -0.521642 0.708251
H  3.781526 3.365068 -0.918038
H  -4.169745 -3.626789 -1.708452
H  -4.78972 -3.567373 -0.042698
H  -3.822915 -4.989738 -0.581328
