program: Gaussian 09
title: 000171001
version: EM64L-G09RevD.01
frameworkgroup: C1[X(C5H8O4)]
method: RPBEPBE
basis: SDD
operation: Freq
keyword: #p
keyword: freq=noraman
keyword: PBEPBE/SDD
title: #p freq=noraman PBEPBE/SDD
converged: YES YES NO NO
title: Mulliken charges:
elementType: O O O O C C C C C H H H H H H H H
charge: -0.260151 -0.240983 -0.458795 -0.432925 -0.153109 -0.127325 -0.140615 -0.110273 -0.305668 0.255498 0.244583 0.269663 0.277329 0.224770 0.256946 0.356875 0.344181
chargesum: 0.00000
title: Mulliken charges with hydrogens summed into heavy atoms:
elementType: O O O O C C C C C
charge: -0.260151 -0.240983 -0.101920 -0.088744 0.102389 0.117258 0.129048 0.167057 0.176048
polarizability: 6.64019491e+01 -2.84217672e+00 6.10017409e+01 -3.32353746e-01 -7.62611552e-01 5.44438679e+01
1716.lowfreq: -18.0995 -16.1647 -0.0008 -0.0004 0.0004 3.9941 91.6919 208.7617 264.0085
frequency: 91.6572 208.7574 264.0075 298.8720 308.0483 346.9708 432.1266 439.1670 505.7461 538.1786 639.3628 745.5958 759.5701 798.2213 842.2481 871.4559 887.7154 920.4900 979.0501 987.3406 1005.8150 1017.9204 1038.6980 1062.5398 1129.3982 1159.8492 1189.1435 1202.2980 1212.7993 1240.9169 1263.8867 1284.9704 1306.2735 1314.6518 1350.6832 1374.8369 1470.7459 2994.3229 3042.5979 3104.8950 3121.6193 3145.7233 3152.9183 3530.9066 3585.4670
redmass: 4.7743 5.4333 2.7573 1.3785 3.0108 3.2056 1.1578 5.9643 7.8169 4.0415 6.5371 6.8497 6.1500 3.8009 3.3239 4.9093 4.1235 3.6955 3.0567 2.2631 2.4524 3.9102 3.9557 1.8076 1.1320 1.1858 1.3378 1.2890 1.3433 1.2189 1.3655 1.6592 1.4912 1.2982 1.2127 1.4941 1.0886 1.0864 1.0585 1.0874 1.1094 1.0895 1.0963 1.0656 1.0665
irintensity: 1.6558 7.9851 34.2993 97.0288 34.7180 0.9246 159.5244 4.2582 14.4220 20.1104 11.5800 16.5913 21.4686 35.4053 18.3267 35.7382 20.7747 6.9144 63.1022 66.3389 114.0570 24.1652 31.7519 2.9075 3.8920 12.7993 28.8287 28.7176 8.9810 2.5674 2.2160 13.6451 6.0842 1.4381 31.9577 1.0351 8.7025 37.4082 43.0479 10.0365 8.9929 24.6460 3.2977 7.7617 11.6914
temp: 298.150 k
press: 1.00000 atm
elementType: 8 8 8 8 6 6 6 6 6 1 1 1 1 1 1 1 1
symmnumber: 1
zpe: 347924.6 jmol-1
zpe.correction: 0.132517 hartree
zpe.thermalcorrener: 0.140305 hartree
zpe.thermalcorrenthalpy: 0.141249 hartree
zpe.thermalcorrgfe: 0.100459 hartree
zpe.sumelectzpe: -495.455362 hartree
zpe.sumelectthermal: -495.447575 hartree
zpe.sumelectthermalent: -495.446630 hartree
zpe.sumelectthermalfe: -495.487421 hartree
dipole: 0.4216 1.8747 1.4004
dipole: 2.3777
quadrupole: -55.1162 -51.5428 -53.2087
quadrupole: 0.5270 -0.5610 -0.3852
quadrupole: -1.8270 1.7464 0.0805 0.5270 -0.5610 -0.3852
hfenergy: -495.5878795 hartree
pointgroup: C01 [X(C5H8O4)]
dipole: -0.314095 -0.7218585 0.5053282 debye
dipolederiv: -0.5818645 0.0128622 -0.0390962 -0.0026129 -0.536187 0.0073816 0.0454729 -0.0125079 -0.6221777 -0.7516558 0.1377687 0.0898165 0.201335 -0.4955269 -0.0383195 0.0275637 0.0507006 -0.4753057 -0.1632294 -0.0462471 0.0193095 -0.0768058 -0.882909 -0.067676 0.0225938 -0.1335619 -0.5671636 -0.7479021 0.1783032 0.1774345 0.1232783 -0.6334595 0.0504871 0.2489698 0.0169185 -0.2458924 0.2745969 -0.0381738 0.0239768 0.0268935 0.320708 -0.0479663 0.0127717 0.0227154 0.2294265 0.1012052 0.0878217 -0.0687103 0.147391 0.5487195 0.1448723 -0.0543224 0.2267862 0.340262 0.4548018 -0.1889113 -0.0789992 -0.2596946 0.1987025 -0.0021556 -0.1370773 0.1201618 0.184599 0.7132437 -0.0255738 -0.037513 -0.0530595 0.4491213 0.0163327 -0.1363139 -0.0303141 0.5927834 0.2970187 -0.0815259 0.1396336 -0.2004538 0.3266794 0.0335188 0.1989854 -0.1152354 0.1641058 0.055903 0.0207825 -0.0314164 0.0111259 0.0486997 0.0541204 -0.0569604 0.0851247 -0.0383484 -0.0615032 -0.0172834 0.1231194 -0.0048473 -0.0255688 -0.0205995 0.0999349 -0.0155657 -0.0795143 0.0304236 0.0058554 -0.0391573 0.0179372 0.0563247 -0.0394886 -0.0215899 -0.0396629 -0.0673607 0.0483534 0.0059225 0.0040235 0.0257029 -0.0797405 0.0297035 -0.0072081 0.0034826 0.0805975 -0.1528436 0.0137564 -0.062943 -0.0323861 0.0360676 0.0015243 -0.0977137 0.038136 0.048558 0.1188312 0.0199442 -0.0261543 0.0693294 -0.0336769 -0.047409 -0.0048781 -0.0801337 0.0400947 0.0473711 -0.0376275 -0.0590382 0.0205066 0.3568171 -0.0358276 -0.0526098 -0.0708083 0.3358009 0.3172501 -0.0476739 -0.1342858 -0.0136397 0.3452289 -0.0384986 -0.0876186 -0.0662358 0.0795349 unknown
polarizability: 64.9600687|-3.7227115|62.3124305|0.0851326|1.2821441|54.5750587 unknown
InChI: InChI=1S/C5H8O4/c6-3-2-1-8-5(9-2)4(3)7/h2-7H,1H2
charge 0 multiplicity 1
17 atoms
O  0.516842 0.948044 1.169301
O  1.335005 0.711476 -1.017743
O  -0.493785 -2.150065 -0.450687
O  -2.272909 0.989096 0.019437
C  0.731296 -0.521374 0.918021
C  -0.651694 -0.932363 0.335998
C  -1.050303 0.359753 -0.478979
C  0.199593 1.248228 -0.254275
C  1.774115 -0.491235 -0.220436
H  1.035651 -1.012773 1.849196
H  -1.387236 -1.074284 1.153214
H  -1.232797 0.147514 -1.542744
H  0.100788 2.327358 -0.419375
H  2.795095 -0.304451 0.149958
H  1.728118 -1.384792 -0.860979
H  -1.379567 -2.454234 -0.769061
H  -2.099613 1.3058 0.944654
