program: Gaussian 09
title: 000171174
version: EM64L-G09RevD.01
frameworkgroup: C1[X(C20H32O6)]
method: RPBEPBE
basis: SDD
operation: Freq
keyword: #pfreq=noraman
keyword: PBEPBE/SDD
title: #p freq=noraman PBEPBE/SDD
converged: YES YES NO NO
title: Mulliken charges:
elementType: O O O O O O C C C C C C C C C C C C C C C C C C C C H H H H H H H H H H H H H H H H H H H H H H H H H H H H H H H H
charge: -0.512996 -0.493325 -0.472272 -0.424588 -0.172160 -0.450650 0.445279 -0.244109 -0.200091 0.343452 -0.672425 -0.252797 -0.484996 -0.492761 -0.672768 0.452772 -0.812540 -0.110889 -0.280901 0.098259 0.203741 -0.513065 -0.118082 -0.770234 -0.747163 -0.749977 0.250532 0.280621 0.238446 0.271095 0.253255 0.215072 0.218990 0.205987 0.226126 0.232322 0.256020 0.234249 0.248743 0.209878 0.203406 0.370935 0.345713 0.277082 0.258257 0.204524 0.217831 0.235640 0.211989 0.383420 0.191787 0.261390 0.248721 0.227413 0.229162 0.228709 0.331379 0.336590
chargesum: 0.00000
title: Mulliken charges with hydrogens summed into heavy atoms:
elementType: O O O O O O C C C C C C C C C C C C C C C C C C C C
charge: -0.142061 -0.147612 -0.088852 -0.093209 -0.172160 -0.114060 0.445279 0.006423 0.080530 0.343452 -0.162883 0.000457 -0.050934 -0.060648 -0.184425 0.452772 -0.119669 0.092517 -0.003818 0.098259 0.203741 -0.050284 0.099748 -0.322605 -0.045265 -0.064692
polarizability: 2.66235500e+02 -2.52382956e-01 2.13520844e+02 3.38429553e+00 -5.25666715e+00 1.95949669e+02
1716.lowfreq: -18.4268 -9.0810 -0.0008 -0.0005 0.0006 10.8169 44.2696 60.8519 81.0234
frequency: 43.6104 60.8227 80.9183 93.5376 101.3010 106.4687 130.2999 138.6583 156.3028 178.6152 185.8347 191.8814 201.3965 205.7052 214.0089 229.3539 241.8630 251.2161 259.2409 263.9511 280.6891 289.8710 304.6713 312.5782 316.3270 325.9274 333.1782 339.4749 346.1630 359.7307 361.0360 373.7744 387.3415 403.3134 408.1610 414.4061 427.6906 438.7322 447.4100 487.2132 522.1165 536.7746 552.0484 564.0764 576.0469 632.0122 636.9852 650.3783 692.4201 711.6511 719.8465 729.5119 753.6006 763.7094 770.0389 798.2587 816.1429 824.2831 827.2728 843.2889 851.8152 878.6868 889.0438 898.2379 910.1873 918.2126 921.4369 922.5330 942.3525 950.4912 978.2977 980.6028 984.6452 998.3473 1003.0483 1008.5870 1018.4837 1026.2282 1038.2979 1053.5490 1065.9091 1073.1290 1086.1499 1095.2654 1104.6432 1115.6128 1129.4350 1142.5837 1161.2716 1162.4580 1172.7663 1183.6414 1196.2017 1201.5957 1209.7529 1217.9272 1231.3955 1241.5755 1245.9136 1250.4977 1269.3945 1274.7532 1281.0327 1290.6322 1297.7653 1309.1690 1317.2874 1321.2580 1328.5806 1334.3223 1342.4936 1353.2879 1359.9330 1363.1860 1371.6202 1376.6344 1387.8311 1388.8072 1389.6024 1395.8335 1427.3766 1436.2104 1451.2896 1455.8219 1460.0419 1463.6963 1465.2319 1469.0968 1471.4904 1475.5956 1483.7409 1484.5052 1488.5653 1492.3072 1613.7106 1644.5410 2965.7975 2966.1209 2968.8587 2975.9353 2982.7170 2988.6789 2994.5384 2998.0349 3002.4383 3004.0446 3007.9987 3015.2078 3031.0041 3050.4021 3054.6829 3057.6105 3066.1493 3066.6907 3067.0883 3072.5020 3073.1208 3092.2933 3093.1792 3096.0184 3102.4990 3103.6407 3170.3266 3195.2439 3266.0485 3536.2841 3550.6184 3559.8265
redmass: 4.0278 5.4856 5.3212 4.6388 5.6957 5.7743 3.6651 4.1635 4.1254 1.5487 3.3726 2.5259 4.3578 1.2672 3.6082 1.3979 3.8668 2.2269 2.6117 2.6079 3.2043 2.9139 2.4671 3.0454 2.1231 2.6318 3.4041 2.4085 1.6983 2.3880 2.2113 1.6115 1.5548 2.8777 2.8258 3.4614 2.8153 3.9041 2.9917 3.3997 3.1910 3.0047 3.2281 2.6178 4.1191 3.2285 3.2444 2.6412 2.3730 1.5782 1.4682 2.8086 3.1019 3.0063 2.3360 2.8415 2.7839 1.9321 1.4442 2.8002 2.9776 3.1010 2.3317 2.3514 4.0146 2.1421 1.9489 1.3741 1.5856 2.4047 2.0605 2.2005 2.7257 2.2695 2.3437 2.5768 2.1804 2.0721 2.0536 1.7450 2.1576 2.5167 2.2625 1.8003 2.7721 3.0405 1.7683 2.0243 1.7126 1.4866 1.3247 1.6642 1.8624 1.4252 1.6431 2.0433 1.3558 1.5362 2.3653 1.4475 1.4583 1.5880 1.2509 1.3669 1.4975 1.2001 1.4320 1.3805 1.4057 1.4022 1.4762 1.5125 1.4049 1.4709 1.4834 1.1812 1.1762 1.2461 1.2340 1.1929 1.1662 1.1819 1.0531 1.0796 1.0598 1.1105 1.1248 1.0674 1.2179 1.0685 1.0687 1.0597 1.0795 1.0644 9.3618 4.5073 1.0824 1.0830 1.0387 1.0389 1.0621 1.0796 1.0672 1.0361 1.0631 1.0630 1.0807 1.0637 1.0981 1.1006 1.0983 1.0878 1.0907 1.0937 1.0950 1.0940 1.1017 1.0986 1.0992 1.1001 1.0621 1.1004 1.0674 1.1121 1.0663 1.0660 1.0657 1.0655
irintensity: 1.7964 1.7532 3.1131 3.8925 0.3122 2.7412 0.8022 0.6981 1.6647 1.4816 0.2742 2.8125 0.0709 0.5223 3.1325 1.0718 0.3137 2.4040 4.5938 5.9112 23.4641 11.0491 17.5612 4.4129 20.7670 13.1589 15.0039 26.3993 61.4733 39.7751 4.2272 83.7733 38.1524 16.2405 77.9772 8.3471 3.5202 7.9482 11.2071 1.1550 2.9936 1.0355 11.6328 17.4651 4.2999 2.0537 11.0234 7.1652 4.2707 3.6629 10.9664 11.2257 5.9988 2.2153 29.4611 16.5684 8.5215 31.3080 82.6702 17.6007 21.9289 6.5075 12.6108 41.5523 72.7934 8.2314 30.5506 57.6558 1.6682 2.8610 7.4504 19.1530 59.7995 18.5434 46.5590 54.5146 4.9671 13.9618 16.0269 17.5548 8.3558 25.6604 94.1129 18.5331 13.1312 11.9284 9.4260 8.8690 16.7174 6.5204 4.3360 5.1129 26.1563 36.2544 18.4776 3.7398 18.6077 12.8853 11.2027 8.4596 6.2166 10.0285 34.6225 16.7375 11.2635 21.2022 8.9859 17.2925 2.5754 14.9959 3.3705 4.0002 14.1732 5.0509 1.0804 21.4369 26.6541 40.1759 6.1170 14.5309 8.0815 58.2895 5.4576 2.7939 6.7048 14.0360 30.3537 20.4393 50.1160 33.3366 4.7861 16.4367 20.1911 11.7031 87.3481 18.7275 10.2715 52.6787 37.6153 24.9518 23.2222 28.2398 28.2823 16.7166 17.7307 7.1452 57.2617 18.8437 38.9639 34.3358 24.3356 3.9724 20.3747 24.8896 20.6825 24.2096 16.1732 18.3232 17.9632 20.5022 5.5855 15.1030 565.4301 25.3386 173.8855 5.9469 5.2525 4.1207
temp: 298.150 k
press: 1.00000 atm
elementType: 8 8 8 8 8 8 6 6 6 6 6 6 6 6 6 6 6 6 6 6 6 6 6 6 6 6 1 1 1 1 1 1 1 1 1 1 1 1 1 1 1 1 1 1 1 1 1 1 1 1 1 1 1 1 1 1 1 1
symmnumber: 1
zpe: 1296669.4 jmol-1
zpe.correction: 0.493875 hartree
zpe.thermalcorrener: 0.520069 hartree
zpe.thermalcorrenthalpy: 0.521013 hartree
zpe.thermalcorrgfe: 0.442392 hartree
zpe.sumelectzpe: -1230.557633 hartree
zpe.sumelectthermal: -1230.531440 hartree
zpe.sumelectthermalent: -1230.530496 hartree
zpe.sumelectthermalfe: -1230.609116 hartree
dipole: 6.4173 3.0853 -3.3117
dipole: 7.8529
quadrupole: -136.3088 -166.7749 -165.1444
quadrupole: 1.9163 5.4747 -0.0113
quadrupole: 19.7673 -10.6989 -9.0684 1.9163 5.4747 -0.0113
hfenergy: -1231.0515085 hartree
pointgroup: C01 [X(C20H32O6)]
dipole: -2.5327275 -1.2734389 -1.2284214 debye
polarizability: 266.2073099|-0.5550588|214.024506|-3.6134227|4.3215705|195.4741969 unknown
InChI: InChI=1S/C20H32O6/c1-10-11-5-6-12-16(24)20(11,9-19(12,4)26)8-14(22)17(25)18(2,3)15(23)7-13(10)21/h11-16,21-24,26H,1,5-9H2,2-4H3
charge 0 multiplicity 1
58 atoms
O  -1.852295 1.970064 -1.349399
O  -4.193249 1.971975 -0.032658
O  0.774851 2.516562 -0.836435
O  1.343355 -2.915574 1.66977
O  2.338888 1.77212 1.852912
O  4.429436 -1.020116 -1.528886
C  -1.441886 0.214035 0.431846
C  -3.290722 -0.077565 -1.097327
C  -1.866615 0.52384 -1.044504
C  -3.933482 0.494732 0.206447
C  -2.768566 0.482548 1.238054
C  -1.101331 -1.339319 0.527015
C  -3.162105 -1.624062 -1.101454
C  -2.354616 -2.175874 0.108506
C  -0.300164 1.127204 0.948517
C  0.203718 -1.77305 -0.166552
C  -5.243808 -0.147721 0.670263
C  0.882766 1.281738 -0.039532
C  1.446587 -1.749082 0.742371
C  2.25405 1.324142 0.679626
C  3.507044 0.810087 -0.072023
C  2.835721 -1.759706 0.069243
C  3.218208 -0.554187 -0.818798
C  0.269088 -2.292425 -1.424618
C  3.842413 1.900805 -1.144195
C  4.691072 0.667564 0.911123
H  -3.846704 0.254185 -1.995664
H  -1.189316 0.07029 -1.78527
H  -2.936835 -0.273584 2.024603
H  -2.735776 1.467159 1.736167
H  -0.932644 -1.53845 1.606325
H  -2.678723 -1.91179 -2.054753
H  -4.166256 -2.090258 -1.114706
H  -3.031095 -2.229502 0.982623
H  -2.047469 -3.217542 -0.097802
H  0.052162 0.759163 1.929988
H  -0.694136 2.141598 1.14098
H  -5.098744 -1.207035 0.943262
H  -5.630917 0.383429 1.557666
H  -6.01638 -0.111065 -0.122792
H  0.880487 0.42218 -0.736671
H  -2.659655 2.362886 -0.893234
H  -4.998228 2.066754 -0.604167
H  1.379648 -0.908362 1.45232
H  3.584905 -1.86938 0.873513
H  2.934326 -2.661265 -0.566495
H  2.426466 -0.372762 -1.575625
H  1.215727 -2.616459 -1.871417
H  -0.618911 -2.418426 -2.052058
H  -0.190302 2.543046 -1.143467
H  4.809621 1.673278 -1.634591
H  3.044355 1.993322 -1.900877
H  3.949388 2.887177 -0.661225
H  4.422597 0.059407 1.79215
H  5.544973 0.192153 0.398207
H  4.997165 1.657248 1.288967
H  1.371493 -3.739449 1.116463
H  4.700215 -0.32298 -2.178834
