program: Gaussian 09
title: 000171112
version: EM64L-G09RevD.01
frameworkgroup: C1[X(C21H28O8S)]
method: RPBEPBE
basis: SDD
operation: Freq
keyword: #p
keyword: freq=noraman
keyword: PBEPBE/SDD
title: #p freq=noraman PBEPBE/SDD
converged: YES YES NO NO
title: Mulliken charges:
elementType: S O O O O O O O O C C C C C C C C C C C C C C C C C C C C C H H H H H H H H H H H H H H H H H H H H H H H H H H H H
charge: 1.185145 -0.433813 -0.201873 -0.279064 -0.230652 -0.360981 -0.531760 -0.448901 -0.494395 -0.121485 -0.197221 0.329281 -0.150737 0.255254 -0.164972 -0.665004 -0.247183 -0.500871 -0.479619 -0.483006 0.507284 -0.628670 -0.524228 -0.115990 -0.775280 0.216379 -0.552124 -0.564209 0.175844 -0.438189 0.217419 0.297644 0.225290 0.216413 0.220881 0.246160 0.245934 0.207253 0.283914 0.232873 0.213719 0.275642 0.210618 0.236888 0.227299 0.216372 0.226197 0.176354 0.247956 0.215315 0.228152 0.223503 0.246203 0.255650 0.347162 0.282163 0.281325 0.416739
chargesum: 0.00000
title: Mulliken charges with hydrogens summed into heavy atoms:
elementType: S O O O O O O O O C C C C C C C C C C C C C C C C C C C C C
charge: 1.185145 -0.086651 -0.201873 -0.279064 -0.230652 -0.360981 -0.115022 -0.448901 -0.494395 0.095933 0.100423 0.329281 0.074553 0.255254 0.051441 -0.197963 -0.001249 -0.009703 -0.033026 0.003254 0.507284 -0.164483 -0.081659 0.060364 -0.083857 0.216379 -0.082417 -0.308559 0.175844 0.125299
polarizability: 3.40595894e+02 -2.12148423e+00 2.53388496e+02 -2.21837873e+01 1.54313728e+00 2.26955767e+02
1716.lowfreq: -9.1013 -0.0012 -0.0009 -0.0007 2.9735 5.5742 11.6340 16.1719 29.4767
frequency: 8.4568 16.0373 29.4537 41.5342 50.0799 59.8486 82.0790 102.4822 111.7719 122.1639 131.9347 150.3459 154.4427 158.7434 182.5092 195.1964 200.3459 208.9949 224.4486 229.8119 235.8763 262.2487 267.7782 277.7127 288.1757 301.0120 313.2672 326.1063 338.6420 344.0949 345.7496 347.9319 355.0294 364.8485 386.8307 396.8263 411.4608 416.2357 450.1236 453.0013 469.4653 473.8996 496.6628 508.4329 522.8667 550.6159 568.4970 589.7933 606.9945 612.1080 619.2789 645.2241 679.2144 709.5213 715.2974 738.1775 760.9555 767.8232 779.2300 798.5171 834.8175 846.3639 854.7786 860.3600 863.6862 880.3857 890.2498 904.0450 908.1716 917.3184 927.5632 937.3846 966.3124 977.0727 981.7552 987.5020 993.5942 999.4027 1003.3646 1007.1382 1016.5548 1030.6349 1041.5081 1052.1038 1061.5577 1080.7847 1084.9766 1106.7705 1109.1518 1114.6432 1119.2865 1133.5730 1156.4423 1168.5099 1171.8013 1177.9653 1186.6415 1210.0165 1212.9960 1221.4840 1224.4881 1228.1086 1239.7319 1244.9617 1258.9901 1267.3969 1276.0389 1278.6818 1286.0133 1300.4291 1308.8386 1315.2887 1316.9366 1320.8096 1324.0661 1327.8543 1333.3612 1341.4163 1345.0619 1348.4795 1354.9529 1358.4489 1372.5155 1377.9293 1387.4106 1395.5693 1402.3620 1449.1532 1460.9457 1462.3299 1465.0750 1466.4128 1471.9260 1477.5132 1479.3930 1496.2937 1586.0072 1597.9457 1621.9028 1625.8665 2821.7396 2904.7361 2925.9533 2937.8781 2944.6643 2955.1144 2960.3932 2962.3317 2969.5802 2978.6437 2989.3743 2992.7934 2996.7262 3016.4054 3024.9341 3026.3234 3028.4806 3040.4207 3043.0905 3044.4649 3058.3332 3063.8365 3077.8393 3089.4310 3101.0532 3115.0272 3119.9099 3547.8516
redmass: 8.0204 8.7954 7.0672 4.7131 6.9694 6.7449 7.0554 8.1331 6.9235 4.2870 5.4668 3.7612 3.0204 6.0591 4.4012 4.7909 3.3297 3.4393 3.8738 3.9964 4.1660 2.2553 1.9941 4.5887 4.4578 5.2615 2.7473 3.8313 4.7040 3.5359 4.6501 1.4619 3.1175 2.7262 2.9001 2.4172 4.4734 3.1442 3.8953 3.3816 5.2639 3.3981 3.6916 3.4628 3.2078 3.2028 3.2948 2.8145 13.4932 4.0980 3.5039 3.8595 3.6726 4.9758 3.3886 2.9223 2.3141 1.1467 2.3088 2.2255 2.3003 2.3525 2.3874 3.1206 8.2941 2.7649 1.4902 2.9578 2.3431 2.2978 1.9933 2.0569 2.6138 4.2187 2.8904 2.4188 1.8525 2.3606 10.9021 2.5258 2.5038 1.9715 1.8325 2.2826 2.7064 2.3699 1.9898 1.9243 2.3396 1.6943 2.2062 1.4942 2.2584 1.6069 2.3341 1.6098 1.7883 1.7070 1.2046 1.2454 1.5639 1.6581 1.2363 1.3793 1.4955 1.3825 1.9433 1.3418 1.3704 1.3329 1.3315 1.1959 1.2561 1.5348 1.2942 1.3704 1.4672 2.1420 1.3567 1.4340 1.4271 1.5619 1.4740 1.5115 1.0770 1.2078 1.2174 1.0816 1.0923 1.0833 1.0793 1.0826 1.0814 1.0987 1.0797 1.0600 9.9919 7.8986 7.8103 7.7932 1.0705 1.0811 1.0805 1.0864 1.0667 1.0794 1.0636 1.0697 1.0674 1.0763 1.0580 1.0467 1.0571 1.0596 1.0933 1.0872 1.0691 1.0941 1.0983 1.0933 1.1028 1.0941 1.1040 1.0956 1.1044 1.0985 1.0912 1.0662
irintensity: 0.1955 2.9334 6.1698 0.9686 0.7206 0.7314 2.5804 0.2958 1.9994 6.4618 0.3301 1.6169 0.3519 2.1950 4.9772 3.2562 6.7405 11.5846 3.9316 3.6224 3.1336 2.8988 2.4067 2.3313 7.4280 1.0339 7.7369 25.4539 33.1024 4.0504 35.3282 88.3893 25.9010 0.8825 0.3979 1.7173 2.8141 1.8015 5.3427 2.5612 69.5206 40.8347 2.4771 3.0038 8.1712 1.2602 0.7994 2.9382 71.0382 6.0326 4.3545 0.8067 6.6856 33.3712 14.3677 4.4579 7.1930 88.2035 7.4443 4.7687 2.0817 12.1735 1.2119 20.0582 107.5868 12.5039 25.4759 21.7889 21.1222 4.8402 4.5164 9.3119 13.8686 42.3333 5.8272 11.4809 8.5143 4.9163 105.2964 2.0011 32.9756 5.4306 5.4516 35.9775 10.3863 5.5026 8.8280 7.9127 0.8814 8.1355 11.0649 20.5201 10.1473 2.8691 0.0610 15.4703 16.2469 16.4898 7.7962 5.6697 2.6702 35.6712 4.4259 4.7014 24.2914 7.4441 38.3341 1.9699 15.4986 27.5612 0.6509 205.1284 28.3170 11.6664 21.0388 20.8075 5.8209 6.0287 2.9409 2.5267 2.9783 4.6917 14.3014 5.6045 30.2492 14.8821 2.3856 13.3204 17.1766 6.3858 2.7480 9.5089 10.9662 20.0453 22.2309 4.4928 182.2806 81.8523 118.4484 183.0892 1065.1635 17.6615 14.4846 55.8239 47.0975 10.4629 29.6383 20.3692 11.6805 63.7095 17.0732 21.7196 41.5233 23.1230 14.8774 6.6397 50.0824 0.3626 27.7218 37.4801 28.9126 22.9706 3.3639 32.5371 16.9314 15.6613 10.4758 8.8886
temp: 298.150 k
press: 1.00000 atm
elementType: 16 8 8 8 8 8 8 8 8 6 6 6 6 6 6 6 6 6 6 6 6 6 6 6 6 6 6 6 6 6 1 1 1 1 1 1 1 1 1 1 1 1 1 1 1 1 1 1 1 1 1 1 1 1 1 1 1 1
symmnumber: 1
zpe: 1213546.4 jmol-1
zpe.correction: 0.462215 hartree
zpe.thermalcorrener: 0.491377 hartree
zpe.thermalcorrenthalpy: 0.492321 hartree
zpe.thermalcorrgfe: 0.401428 hartree
zpe.sumelectzpe: -1814.360612 hartree
zpe.sumelectthermal: -1814.331451 hartree
zpe.sumelectthermalent: -1814.330507 hartree
zpe.sumelectthermalfe: -1814.421400 hartree
dipole: 2.3298 2.2712 -1.7121
dipole: 3.6766
quadrupole: -277.9182 -191.1461 -188.9247
quadrupole: 6.2944 24.2570 -20.0106
quadrupole: -58.5885 28.1835 30.4050 6.2944 24.2570 -20.0106
hfenergy: -1814.8228275 hartree
pointgroup: C01 [X(C21H28O8S1)]
dipole: 0.9238021 -0.898555 0.6568867 debye
polarizability: 341.8671906|1.15805|253.3708973|18.7428529|0.8760529|225.7020691 unknown
InChI: InChI=1S/C21H28O8S/c1-20-7-6-13(23)8-12(20)2-3-14-15-4-5-16(18(25)10-29-30(26,27)28)21(15,11-22)9-17(24)19(14)20/h8,11,14-17,19,24,26H,2-7,9-10H2,1H3
charge 0 multiplicity 1
58 atoms
S  -6.375042 1.359565 0.312399
O  0.764706 0.718021 -2.300675
O  -0.948605 -2.184296 -1.875701
O  -3.763157 -0.280614 -0.716538
O  6.310735 2.2618 1.764016
O  -5.812984 -0.232184 1.210323
O  -6.106377 0.800885 -1.348629
O  -7.940125 1.515773 0.548371
O  -5.315634 2.503957 0.73157
C  0.291932 -1.284809 0.650393
C  1.636353 -1.229441 -0.105246
C  -0.837201 -0.480904 -0.064289
C  2.05021 0.275255 -0.257145
C  3.487805 0.429451 -0.91743
C  0.929614 1.140335 -0.889672
C  -0.430903 1.00393 -0.152109
C  -2.023607 -0.806589 0.908064
C  -0.348759 -2.658406 0.989046
C  2.714058 -2.03571 0.664844
C  -1.882048 -2.367016 1.146869
C  4.422971 -0.347687 0.024626
C  4.156579 -1.834169 0.109658
C  3.955604 1.911485 -1.028017
C  -1.16758 -1.013942 -1.483918
C  3.574263 -0.177714 -2.352756
C  -3.420364 -0.418629 0.497213
C  4.355435 2.558382 0.313345
C  5.334419 0.2651 0.847488
C  5.431983 1.72965 1.018867
C  -4.421896 -0.175084 1.633404
H  0.462027 -0.757496 1.618783
H  1.498224 -1.671912 -1.108759
H  2.151874 0.674258 0.778944
H  1.234666 2.207155 -0.862355
H  -0.336543 1.428642 0.867659
H  -1.194542 1.608449 -0.683592
H  -1.804218 -0.305871 1.876713
H  0.075999 -3.087102 1.913504
H  -0.189714 -3.370775 0.164446
H  2.4589 -3.111946 0.641584
H  2.706598 -1.720814 1.729757
H  -2.458113 -2.91783 0.383758
H  -2.270154 -2.650861 2.140551
H  4.234405 -2.313864 -0.884133
H  4.885853 -2.328057 0.776554
H  3.184576 2.516203 -1.539733
H  4.841531 1.926941 -1.69348
H  -1.674781 -0.27689 -2.146705
H  3.048889 0.475022 -3.066907
H  4.634742 -0.262178 -2.656421
H  3.113926 -1.174951 -2.434251
H  3.484083 2.631982 0.99737
H  4.735761 3.585473 0.173296
H  6.000575 -0.333102 1.482991
H  0.124487 1.328402 -2.748664
H  -4.175167 0.803472 2.103281
H  -4.330142 -0.957839 2.410145
H  -5.204125 0.288094 -1.292006
