program: Gaussian 09
title: 000171051
version: EM64L-G09RevD.01
frameworkgroup: C1[X(C14H22N4O6S2)]
method: RPBEPBE
basis: SDD
operation: Freq
keyword: #p
keyword: freq=noraman
keyword: PBEPBE/SDD
title: #p freq=noraman PBEPBE/SDD
converged: YES YES NO NO
title: Mulliken charges:
elementType: S S O O O O O O N N N N C C C C C C C C C C C C C C H H H H H H H H H H H H H H H H H H H H H H
charge: 0.902970 0.547317 -0.562763 -0.521458 -0.203416 -0.184987 -0.209870 -0.200807 -0.135393 -0.006662 -0.001019 -0.577068 -0.391490 -0.355501 0.273083 -0.353468 -0.386792 0.295463 0.289009 -0.064596 -0.364840 -0.407218 -0.682845 -0.683973 -0.769319 -0.783095 0.230189 0.247632 0.262716 0.217389 0.228703 0.211701 0.228156 0.228228 0.315974 0.337275 0.212118 0.217141 0.227555 0.209880 0.219522 0.227384 0.300101 0.257725 0.299514 0.273693 0.328501 0.257643
chargesum: 0.00000
title: Mulliken charges with hydrogens summed into heavy atoms:
elementType: S S O O O O O O N N N N C C C C C C C C C C C C C C
charge: 0.902970 0.547317 -0.562763 -0.521458 -0.203416 -0.184987 -0.209870 -0.200807 -0.135393 -0.006662 -0.001019 -0.577068 0.086331 0.124604 0.273083 0.086936 0.069592 0.295463 0.289009 -0.064596 -0.048867 -0.069942 -0.026031 -0.027187 0.088020 0.076741
polarizability: 3.85313219e+02 -1.65710318e+01 2.74401770e+02 4.68613169e+00 -1.67178481e+01 2.01614562e+02
1716.lowfreq: -10.0726 -4.6592 -0.0021 0.0002 0.0008 4.0011 11.2716 21.0798 24.5531
frequency: 9.9453 20.9277 24.4798 38.7936 41.9605 48.9188 56.8761 71.5274 80.1021 80.9820 84.9684 95.3516 105.4753 111.9343 127.1378 136.8395 152.6020 164.3234 165.5409 177.0837 186.1433 191.1905 203.5804 214.5410 219.5979 229.4972 247.7693 250.1872 256.4504 278.9139 283.6924 309.6915 321.6236 326.5004 356.2099 378.1439 380.4111 410.8794 414.2553 436.6052 465.3499 498.8788 536.1959 551.4053 563.8790 596.0811 623.3874 629.7635 644.1386 653.2063 666.1644 686.1316 698.6446 729.9809 749.5925 754.6640 757.5883 782.1422 816.6332 861.7562 873.7674 878.5535 899.3067 910.6371 912.9762 928.4669 948.5720 958.5205 967.1007 978.6365 1006.7752 1042.7411 1052.7258 1054.5378 1082.5646 1088.2716 1106.8715 1115.3635 1121.5025 1148.5227 1159.3286 1184.7686 1201.2556 1206.8095 1240.8667 1253.2969 1286.0764 1293.0231 1298.8962 1310.6517 1317.1524 1338.3564 1339.5479 1347.6746 1349.9918 1360.0879 1368.7556 1387.0923 1395.7829 1397.2973 1403.8242 1410.9846 1427.6650 1442.4544 1453.7779 1458.1901 1466.2679 1476.0484 1476.8017 1478.8889 1479.9249 1488.0772 1488.8505 1503.5083 1556.5581 1587.1379 2962.3965 2979.4308 2980.4750 2981.3727 2998.8955 3001.2367 3009.1523 3025.2782 3026.6612 3043.7127 3052.0462 3065.1604 3080.2613 3083.1085 3084.6074 3084.9028 3152.5393 3158.5059 3158.9995 3160.6366 3173.1898 3173.7462
redmass: 5.4687 4.8162 3.7499 4.6614 6.6963 4.3634 4.7386 5.3461 2.8061 2.7201 4.5639 5.8210 2.6831 3.0748 2.5234 1.3842 4.4220 4.0993 1.9968 2.4035 5.4164 3.4796 5.4732 1.4271 2.4817 1.7506 3.1997 2.7457 3.4015 3.7047 5.0899 5.9233 3.7599 7.9826 4.4445 9.4484 7.5538 4.9609 5.1971 7.5391 7.3166 8.2094 5.9351 8.5564 6.8470 4.2120 9.7384 7.9005 6.9927 7.4089 9.9088 8.4238 8.9265 6.4135 4.5089 1.1714 1.1233 14.0608 8.8964 5.6604 1.3994 1.4361 1.7488 1.6399 14.9226 1.5569 1.1867 1.3893 1.2277 3.5019 1.2745 3.1463 1.2927 3.0218 2.3569 1.7951 2.0822 4.6853 2.3701 2.1967 2.0065 8.6975 4.3923 2.3519 1.3315 1.2807 1.1754 1.4277 1.1331 1.3215 1.1315 2.2145 6.0032 1.1325 2.6012 2.8490 1.9682 1.6769 1.2082 1.3016 7.5864 1.0495 1.0458 1.0520 1.0552 1.1194 1.5380 1.0490 1.0452 1.0486 1.0418 1.2123 1.0899 1.6190 9.2916 7.8377 1.0630 1.0411 1.0371 1.0560 1.0598 1.0600 1.0259 1.0276 1.0963 1.0988 1.1018 1.1009 1.1020 1.1019 1.0995 1.0997 1.1065 1.1072 1.1064 1.0923 1.0924 1.1054
irintensity: 3.9176 2.0075 1.1250 0.4907 1.7207 0.6281 1.1550 0.7287 1.8196 0.4164 1.4457 2.5872 2.5227 0.9100 7.0674 4.4009 0.7809 0.3516 0.2652 2.6020 7.9523 1.8682 4.4564 0.3644 2.7000 1.3136 5.2441 0.9731 0.8842 2.4721 0.8608 4.0432 0.5672 3.5864 2.1540 12.9889 13.3955 20.2733 16.5085 4.4782 82.4142 41.3118 1.0861 15.6016 18.5673 25.4553 83.3698 41.6143 0.4633 24.3161 16.6475 8.4155 1.3468 4.0521 11.2852 10.2066 0.6071 79.0605 34.0720 12.3007 7.1724 5.5754 2.6681 5.6051 80.8365 9.4515 5.3008 4.0562 5.2826 20.8509 44.8325 0.9388 27.4735 0.8553 24.0982 100.0862 25.3038 30.0158 1.6078 26.0236 43.2549 453.1391 50.8874 55.4628 13.2287 0.5438 5.7079 16.1180 2.6864 1.7210 9.3655 29.6778 75.7846 9.5180 6.9144 45.2754 9.4965 26.4641 8.1171 38.5254 14.3863 17.4177 15.2966 1.4632 45.1824 33.4699 48.2428 2.8758 3.5501 19.6909 11.2730 12.0183 15.9742 88.9508 67.8263 169.2317 21.3499 13.3440 38.2971 42.6470 20.3326 31.5315 14.8806 6.9997 10.2981 0.0098 4.5991 0.4117 39.8378 69.3015 19.4957 54.7471 1.5980 3.7029 6.3271 23.6491 10.0214 0.5598
temp: 298.150 k
press: 1.00000 atm
elementType: 16 16 8 8 8 8 8 8 7 7 7 7 6 6 6 6 6 6 6 6 6 6 6 6 6 6 1 1 1 1 1 1 1 1 1 1 1 1 1 1 1 1 1 1 1 1 1 1
symmnumber: 1
zpe: 945681.7 jmol-1
zpe.correction: 0.360191 hartree
zpe.thermalcorrener: 0.390727 hartree
zpe.thermalcorrenthalpy: 0.391672 hartree
zpe.thermalcorrgfe: 0.295075 hartree
zpe.sumelectzpe: -2010.708944 hartree
zpe.sumelectthermal: -2010.678408 hartree
zpe.sumelectthermalent: -2010.677463 hartree
zpe.sumelectthermalfe: -2010.774060 hartree
dipole: -2.3514 5.7459 4.3287
dipole: 7.5685
quadrupole: -109.7252 -194.0876 -178.8129
quadrupole: -22.1724 -21.5059 11.8709
quadrupole: 51.1500 -33.2123 -17.9377 -22.1724 -21.5059 11.8709
hfenergy: -2011.069135 hartree
pointgroup: C01 [X(C14H22N4O6S2)]
dipole: -1.0369802 -0.3041432 -2.774659 debye
polarizability: 384.5878047|20.6268111|252.6562635|0.8489687|37.1044993|224.0854824 unknown
InChI: InChI=1S/C14H22N4O6S2/c1-5-7-16(8-6-2)14-12(17(19)20)9-11(10-13(14)18(21)22)26(23,24)15-25(3)4/h9-10H,5-8H2,1-4H3
charge 0 multiplicity 1
48 atoms
S  -3.249732 0.035965 1.421894
S  -5.772252 -0.045343 -0.117777
O  -3.666148 -1.505725 1.829998
O  -3.352704 1.199189 2.562207
O  0.014831 -3.065419 -1.460286
O  1.04041 3.209512 1.862558
O  2.051834 -2.754562 -0.481933
O  2.131682 2.868408 -0.109725
N  2.618575 0.066384 -0.348855
N  0.8572 -2.35197 -0.780815
N  1.343235 2.479135 0.840078
N  -3.993297 0.437434 -0.235116
C  3.655328 0.609791 0.567212
C  3.116094 -0.422671 -1.660968
C  1.28277 0.051725 0.013462
C  4.722771 -0.452389 0.930941
C  2.191441 -0.088105 -2.852168
C  0.387787 -1.052271 -0.257756
C  0.67079 1.160864 0.715689
C  -1.465021 0.052554 0.828951
C  -0.974603 -1.035567 0.104433
C  -0.66286 1.14874 1.162241
C  5.748416 0.127372 1.928687
C  2.871373 -0.456312 -4.188717
C  -6.242346 0.866031 -1.693683
C  -5.766536 -1.849544 -0.737382
H  3.17019 0.936982 1.50345
H  4.129977 1.50227 0.113274
H  3.325607 -1.510865 -1.626882
H  4.081022 0.093971 -1.821598
H  4.218476 -1.337514 1.361734
H  5.248095 -0.796802 0.020434
H  1.230518 -0.629665 -2.778983
H  1.954655 0.992778 -2.825745
H  -1.604183 -1.901503 -0.11955
H  -1.0738 1.997577 1.719027
H  6.262038 1.012863 1.509514
H  5.262324 0.435047 2.873139
H  6.519311 -0.623363 2.176917
H  3.808525 0.113128 -4.332938
H  3.117083 -1.533734 -4.229621
H  2.206482 -0.231183 -5.041059
H  -5.418554 0.722926 -2.408124
H  -7.192505 0.453058 -2.063881
H  -6.342497 1.925058 -1.422357
H  -5.212875 -1.876573 -1.68735
H  -5.225192 -2.389711 0.053898
H  -6.806035 -2.196772 -0.842065
