program: Gaussian 09
title: 000171031
version: EM64L-G09RevD.01
frameworkgroup: C1[X(C18H18N4O5S)]
method: RPBEPBE
basis: SDD
operation: Freq
keyword: #p
keyword: freq=noraman
keyword: PBEPBE/SDD
title: #p freq=noraman PBEPBE/SDD
converged: YES YES NO NO
title: Mulliken charges:
elementType: S O O O O O N N N N C C C C C C C C C C C C C C C C C C H H H H H H H H H H H H H H H H H H
charge: 0.324148 -0.291822 -0.448223 -0.462080 -0.427503 -0.195915 -0.214179 -0.045119 -0.031453 -0.010741 -0.150411 -0.196767 -0.052745 -0.071826 -0.321361 0.121789 -0.200670 0.099895 -0.320772 -0.377650 -0.844692 0.216901 0.297611 -0.332865 -0.342334 -0.242731 -0.224822 -0.220849 0.310224 0.303163 0.231281 0.266268 0.202003 0.208273 0.375566 0.365096 0.287507 0.354109 0.250245 0.314276 0.274570 0.244486 0.277893 0.232466 0.234861 0.234899
chargesum: 0.00000
title: Mulliken charges with hydrogens summed into heavy atoms:
elementType: S O O O O O N N N N C C C C C C C C C C C C C C C C C C
charge: 0.324148 -0.291822 -0.072656 -0.096984 -0.073394 -0.195915 -0.214179 -0.045119 -0.031453 -0.010741 0.159813 0.034514 0.250418 0.194442 0.088915 0.121789 0.086838 0.099895 -0.320772 -0.127406 -0.255845 0.216901 0.297611 -0.088379 -0.064441 -0.010265 0.010039 0.014050
polarizability: 3.88490714e+02 -1.59023489e+01 2.11743455e+02 1.47972400e+01 -3.52949960e+00 1.89896490e+02
1716.lowfreq: -14.6241 -7.2518 -2.9424 0.0006 0.0009 0.0016 1.0848 7.4988 16.4322
frequency: -12.6106 6.7511 16.3520 24.1029 29.5886 43.2225 53.6097 82.1558 89.1950 100.9185 123.1150 138.7497 149.9983 170.2032 181.6744 185.3740 198.7284 233.1449 246.4900 256.3468 265.2715 276.9776 304.5916 306.0984 322.6026 351.4477 375.2710 392.2143 400.0731 414.1776 422.4350 430.4584 449.6494 493.7657 535.1260 540.2479 550.2274 568.7289 603.9391 612.2074 623.1720 631.5937 638.2148 662.1389 674.5367 695.9504 732.4112 742.0158 758.0643 772.2042 780.2214 789.1043 791.7446 821.4827 854.3699 857.6189 876.8009 890.1237 907.9786 921.3724 929.1020 950.9310 971.3743 985.6086 989.6462 990.8900 999.4915 1007.8592 1010.6464 1025.2516 1026.9934 1049.5133 1066.6963 1086.4252 1092.8306 1103.7808 1120.3720 1161.9105 1166.3555 1173.4870 1177.9193 1181.2246 1188.3324 1198.3541 1208.7828 1214.4061 1237.5589 1263.0661 1282.0181 1283.8869 1289.1630 1290.8846 1298.6475 1315.8127 1320.6187 1323.2419 1333.0471 1342.9566 1364.2560 1366.6962 1377.5842 1384.8246 1387.3861 1390.0818 1395.5653 1433.8979 1435.7305 1457.5788 1477.8528 1509.8924 1542.9134 1577.4430 1601.4904 1616.7680 2952.7187 2995.5081 3001.4629 3038.2953 3047.7786 3055.8152 3067.7475 3093.7475 3129.6846 3139.7114 3150.8838 3160.3317 3170.4331 3174.1879 3262.6219 3516.8057 3555.0545 3607.5631
redmass: 6.3099 6.2167 6.4900 5.6083 6.6294 6.7992 7.0393 7.2972 5.0972 4.5662 6.7264 6.2362 5.5155 4.1215 7.3919 1.1147 2.8756 6.7365 4.7364 6.5657 4.0997 6.8012 6.2673 7.3246 5.4595 5.8671 2.8212 4.5516 2.9615 5.1462 1.3094 1.1929 7.0100 3.2586 4.5519 3.9190 4.1039 5.3602 7.4518 6.4568 7.8434 7.1725 5.4187 8.1307 4.6964 1.8189 6.3257 5.9919 2.2745 3.3168 4.6965 4.9557 5.1665 9.6876 1.4474 1.2598 3.3212 2.2143 5.5609 1.4325 3.2898 1.5652 4.0532 4.3499 4.7334 1.5178 2.8868 2.9800 1.3459 3.3624 2.0246 4.1769 4.0709 1.5953 5.0766 2.4388 5.7531 1.2589 1.4188 1.0891 1.7451 2.0220 1.1307 1.3596 1.3915 1.7526 1.3049 1.8644 1.4603 1.7223 1.9263 2.0487 3.5164 2.2906 1.3448 1.3363 1.2230 1.4162 5.5332 1.4199 1.1113 1.3471 9.1026 1.5210 1.5858 4.2402 2.2508 1.0908 2.1958 9.4358 10.7578 6.6359 6.6316 7.6387 1.0670 1.0849 1.0610 1.0854 1.0883 1.0963 1.0882 1.0995 1.0852 1.0881 1.0924 1.0961 1.1013 1.0924 1.0982 1.0651 1.0659 1.0671
irintensity: 0.5329 0.5800 1.2931 0.2583 0.0049 2.7088 2.3020 4.0673 7.9654 3.2377 0.2277 0.6522 0.2968 1.4343 3.6416 165.3555 6.3519 10.5405 7.4993 3.6839 11.8217 11.1669 8.5129 4.1522 1.3754 16.0530 32.5369 5.1379 0.5298 2.5067 122.8116 107.9819 2.1264 17.6487 1.5768 3.7348 3.9666 14.5530 20.5673 0.1358 0.2521 24.8742 20.6076 0.0839 43.7883 46.7161 33.8617 31.8041 56.0853 11.6088 62.1658 24.4813 21.1173 4.1645 14.1623 0.5005 26.6118 3.4646 98.0726 8.9835 52.6475 0.3311 145.0343 68.1266 12.5327 0.9960 66.7562 228.6824 0.2377 39.0670 0.6232 28.0662 20.7131 8.8013 39.2637 27.5199 23.3463 42.7563 116.6244 9.6449 5.7857 86.6615 34.4903 36.0394 32.3118 94.6166 9.6636 3.7582 51.8216 43.4304 19.2623 37.3318 103.2370 9.0152 15.6852 21.0181 31.9493 21.1670 50.3292 3.1588 21.7905 45.8753 3.7913 53.3260 57.1244 61.1011 21.3061 5.1727 0.3122 194.4054 152.5948 49.2998 38.2553 22.9322 52.1843 30.9381 55.6922 14.0887 7.3003 53.8358 6.3824 0.8937 0.2455 7.2235 19.5172 19.6160 23.1498 11.5651 1.7970 48.2881 10.5775 20.7283
temp: 298.150 k
press: 1.00000 atm
elementType: 16 8 8 8 8 8 7 7 7 7 6 6 6 6 6 6 6 6 6 6 6 6 6 6 6 6 6 6 1 1 1 1 1 1 1 1 1 1 1 1 1 1 1 1 1 1
symmnumber: 1
zpe: 899985.0 jmol-1
zpe.correction: 0.342786 hartree
zpe.thermalcorrener: 0.367682 hartree
zpe.thermalcorrenthalpy: 0.368627 hartree
zpe.thermalcorrgfe: 0.283903 hartree
zpe.sumelectzpe: -1687.822153 hartree
zpe.sumelectthermal: -1687.797257 hartree
zpe.sumelectthermalent: -1687.796313 hartree
zpe.sumelectthermalfe: -1687.881036 hartree
dipole: -2.3860 3.0492 0.2454
dipole: 3.8796
quadrupole: -137.4335 -173.5379 -169.3013
quadrupole: 4.6408 15.6732 15.8571
quadrupole: 22.6574 -13.4470 -9.2104 4.6408 15.6732 15.8571
hfenergy: -1688.1649394 hartree
pointgroup: C01 [X(C18H18N4O5S1)]
dipole: -0.9181278 -1.2190474 0.0262006 debye
polarizability: 389.0125322|17.3563022|210.9686594|-7.8289032|-5.8818391|190.1494682 unknown
InChI: InChI=1S/C18H18N4O5S/c23-6-12-14(25)15(26)18(27-12)22-9-21-13-16(22)19-8-20-17(13)28-7-11(24)10-4-2-1-3-5-10/h1-5,8-9,12,14-15,18,23,25-26H,6-7H2
charge 0 multiplicity 1
46 atoms
S  -1.99383 2.250699 -0.191216
O  5.126586 0.791983 0.520098
O  5.054876 -1.810199 2.05683
O  5.335996 -2.739536 -0.418738
O  6.741576 1.532001 -1.794038
O  -3.157906 -0.105452 -1.728092
N  2.744427 0.791233 0.774324
N  1.340349 2.344633 -0.186336
N  1.029366 -0.741546 1.734809
N  -1.247087 0.017954 1.251788
C  4.094123 -1.309949 1.080246
C  4.682215 -1.432219 -0.350376
C  4.023464 0.214697 1.286562
C  5.665017 -0.237203 -0.437356
C  5.780252 0.430384 -1.809162
C  1.438629 0.361779 1.04732
C  2.615847 1.991979 0.048504
C  0.58433 1.335172 0.432975
C  -0.809939 1.103462 0.55614
C  -0.329003 -0.838241 1.800093
C  -3.585029 1.34061 0.200516
C  -3.9638 0.270107 -0.834703
C  -5.336109 -0.336839 -0.719111
C  -6.230932 -0.024364 0.340549
C  -5.74111 -1.265811 -1.717016
C  -7.505012 -0.628682 0.398404
C  -7.014413 -1.864734 -1.660383
C  -7.900465 -1.546881 -0.601965
H  3.112348 -1.800779 1.194783
H  4.158109 0.481858 2.347712
H  3.876418 -1.345044 -1.108003
H  6.660686 -0.535615 -0.060583
H  4.776344 0.771561 -2.14345
H  6.177629 -0.285672 -2.551606
H  5.451654 -2.639756 1.678289
H  5.652487 -2.931832 -1.334298
H  3.489787 2.551137 -0.271388
H  6.494428 2.144694 -1.054359
H  -0.733057 -1.694848 2.346018
H  -3.432937 0.845457 1.178431
H  -4.361592 2.117156 0.294811
H  -5.938352 0.678468 1.127421
H  -5.035302 -1.496667 -2.521763
H  -8.187975 -0.386707 1.219884
H  -7.319849 -2.576531 -2.434917
H  -8.891246 -2.012715 -0.556851
