program: Gaussian 09
title: 000170865
version: EM64L-G09RevD.01
frameworkgroup: C1[X(C15H21ClO)]
method: RPBEPBE
basis: SDD
operation: Freq
keyword: #p
keyword: freq=noraman
keyword: PBEPBE/SDD
title: #p freq=noraman PBEPBE/SDD
converged: YES YES NO NO
title: Mulliken charges:
elementType: Cl O C C C C C C C C C C C C C C C H H H H H H H H H H H H H H H H H H H H H
charge: -0.118766 -0.114249 -0.385183 -0.363997 -0.371719 -0.390210 -0.353278 -0.572142 -0.356297 0.519071 -0.695509 -0.397733 -0.403619 -0.363952 -0.302995 0.408440 -0.182027 0.195735 0.195458 0.195334 0.194811 0.190367 0.190608 0.214174 0.214549 0.188738 0.188938 0.215144 0.214039 0.195096 0.194999 0.210077 0.216193 0.210122 0.244456 0.243146 0.268631 0.263549
chargesum: 0.00000
title: Mulliken charges with hydrogens summed into heavy atoms:
elementType: Cl O C C C C C C C C C C C C C C C
charge: -0.118766 -0.114249 0.006010 0.026147 0.009257 0.038513 0.024398 -0.142959 0.033799 0.519071 -0.059116 -0.153277 -0.160473 -0.095322 -0.039446 0.408440 -0.182027
polarizability: 2.65134936e+02 -2.20886606e+01 1.48702214e+02 -1.93928811e+01 -2.00245448e+01 1.38071120e+02
1716.lowfreq: -26.1121 -7.2676 -3.7133 -0.0021 -0.0010 -0.0009 6.8848 11.4173 23.7441
frequency: -18.1681 10.8288 23.6241 37.0712 48.6823 66.8063 77.3707 93.3726 120.7599 128.6016 140.5567 153.9901 170.0953 215.8381 228.4980 276.0236 300.9759 330.8831 356.1389 381.2191 401.2658 427.2982 459.5969 480.3411 527.1054 617.9751 631.8972 642.1077 718.6886 725.5221 742.7211 743.8031 787.7528 791.9328 847.6144 851.6484 856.9654 863.4843 888.7474 927.5324 978.2786 987.2729 992.9842 1001.3531 1009.1556 1013.0327 1038.4313 1055.6904 1074.2998 1077.1060 1080.4850 1117.9922 1134.1670 1184.3950 1185.7741 1212.2802 1214.5917 1218.8837 1221.2202 1254.2993 1255.9518 1277.7506 1280.7926 1289.4773 1291.8967 1292.1437 1312.0308 1320.8057 1340.7568 1353.5178 1354.4721 1383.2510 1389.0968 1416.1253 1460.4506 1460.6956 1465.1675 1467.5766 1473.5444 1475.4598 1479.9519 1486.0552 1488.7061 1493.7836 1567.7392 1613.5780 1709.9351 2949.9307 2951.5699 2953.8382 2960.8454 2968.2254 2972.1004 2972.4341 2984.2902 2984.7303 2991.4945 3002.3353 3016.5115 3027.1291 3038.5727 3053.4733 3068.3758 3071.1166 3130.3017 3135.1711 3161.8018 3174.4090
redmass: 1.6789 5.1660 5.2135 3.2331 5.5587 4.5667 1.7041 2.5296 5.5036 1.8237 2.2062 4.3910 4.6875 1.1415 4.7209 5.8377 3.5812 3.7176 3.4199 9.0599 2.8526 3.7172 3.1516 5.0547 3.6951 6.4521 4.9365 5.3398 1.0620 1.0791 3.0841 1.2299 1.2982 3.3294 1.7716 2.1511 1.2556 1.9500 1.8859 1.2393 2.3554 1.8946 1.3823 1.1662 3.6439 3.2079 3.1718 3.0167 1.2825 2.3263 2.2190 2.5757 1.2739 1.7734 1.4312 1.6746 1.6533 1.4612 2.4021 1.3051 1.3517 1.0911 1.0977 1.1035 1.1068 1.3694 1.2767 1.3855 1.4602 1.5948 1.6810 4.0442 1.2170 3.8337 1.0747 1.0752 1.0689 1.0848 1.0823 1.0425 1.0865 1.0925 1.0984 2.5167 6.7329 6.3350 12.8341 1.0590 1.0589 1.0593 1.0591 1.0589 1.0395 1.0556 1.0592 1.0967 1.0990 1.1016 1.1030 1.1040 1.1047 1.1048 1.1007 1.0992 1.0892 1.0900 1.0957 1.0948
irintensity: 0.0199 0.3261 0.6897 0.0637 0.0090 0.3657 0.0832 0.0360 0.5598 0.1153 0.0102 0.2224 1.3469 0.0007 1.0503 9.7623 1.5322 0.2570 13.0082 9.6775 0.0270 0.2612 1.3379 3.4180 9.4836 45.9122 19.2158 35.3329 14.0833 0.0011 12.8675 7.1005 11.9582 67.2803 45.3604 87.0121 2.3327 50.8262 4.4917 0.6048 4.2549 1.1452 0.1006 0.4587 0.1725 3.5933 1.8218 0.8507 1.8946 0.2907 0.4215 34.4175 7.3350 4.8200 138.5267 107.6619 31.4055 0.0150 1.8899 0.0465 1.6954 0.1841 0.4800 0.0139 0.2006 2.9118 1.5270 4.6687 0.7104 0.3859 1.0757 4.7828 11.0796 17.1372 0.0379 0.0671 0.8427 0.1006 2.3601 12.5162 0.2958 2.1255 32.9301 5.1772 17.0925 160.4346 321.8058 0.2805 3.1474 0.2300 25.7396 105.4333 24.9384 52.8106 74.2203 0.3523 0.4712 0.6348 0.0336 2.0900 79.7473 101.8201 97.9497 55.2516 10.2016 11.6953 5.4695 2.1800
temp: 298.150 k
press: 1.00000 atm
elementType: 17 8 6 6 6 6 6 6 6 6 6 6 6 6 6 6 6 1 1 1 1 1 1 1 1 1 1 1 1 1 1 1 1 1 1 1 1 1
symmnumber: 1
zpe: 842867.2 jmol-1
zpe.correction: 0.321031 hartree
zpe.thermalcorrener: 0.339352 hartree
zpe.thermalcorrenthalpy: 0.340296 hartree
zpe.thermalcorrgfe: 0.270397 hartree
zpe.sumelectzpe: -1118.197576 hartree
zpe.sumelectthermal: -1118.179256 hartree
zpe.sumelectthermalent: -1118.178312 hartree
zpe.sumelectthermalfe: -1118.248210 hartree
dipole: 5.9295 -1.1854 -1.6203
dipole: 6.2601
quadrupole: -150.6242 -108.8121 -111.1759
quadrupole: 2.6699 6.6511 -3.4046
quadrupole: -27.0868 14.7253 12.3615 2.6699 6.6511 -3.4046
hfenergy: -1118.5186074 hartree
pointgroup: C01 [X(C15H21Cl1O1)]
dipole: 2.3183804 0.593594 0.5820059 debye
polarizability: 263.7005124|27.3394988|146.8455521|17.3863812|-20.2255868|141.3622058 unknown
InChI: InChI=1S/C15H21ClO/c1-2-3-4-5-6-7-8-13-9-11-14(12-10-13)15(16)17/h9-12H,2-8H2,1H3
charge 0 multiplicity 1
38 atoms
Cl -6.280587 -1.887839 0.255585
O  -6.061651 0.09383 -1.605557
C  3.540233 -0.13836 -0.127566
C  2.462044 0.646898 0.652989
C  4.982695 0.245821 0.273566
C  1.021766 0.262098 0.249049
C  6.063791 -0.537711 -0.504283
C  -0.054622 1.061522 1.041635
C  7.506001 -0.149901 -0.104487
C  -1.465724 0.682807 0.633592
C  8.580864 -0.935241 -0.886482
C  -2.11801 1.349184 -0.440055
C  -2.152527 -0.378204 1.282235
C  -3.405826 0.970429 -0.853522
C  -3.442732 -0.769139 0.879216
C  -4.083317 -0.098242 -0.195149
C  -5.434841 -0.434442 -0.687369
H  3.39231 -1.226279 0.034966
H  3.404709 0.034424 -1.215525
H  2.597422 0.4738 1.741109
H  2.610732 1.734915 0.490222
H  5.130679 1.333894 0.109968
H  5.118214 0.074313 1.362037
H  0.878338 0.437222 -0.83608
H  0.863661 -0.822554 0.414227
H  5.929341 -0.368421 -1.593204
H  5.919861 -1.626127 -0.33962
H  0.093319 0.875503 2.122928
H  0.114908 2.142487 0.871685
H  7.640155 -0.320195 0.983385
H  7.648655 0.937864 -0.268351
H  8.487999 -0.758358 -1.974712
H  9.601556 -0.638797 -0.582294
H  8.480094 -2.023624 -0.714945
H  -1.60749 2.175187 -0.94901
H  -1.668048 -0.899018 2.116376
H  -3.906923 1.488052 -1.678146
H  -3.962651 -1.585298 1.388487
