program: Gaussian 09
title: 000165722
version: EM64L-G09RevD.01
frameworkgroup: C1[X(C18H34O4)]
method: RPBEPBE
basis: SDD
operation: Freq
keyword: #pfreq=noraman
keyword: PBEPBE/SDD
title: #p freq=noraman PBEPBE/SDD
converged: YES YES NO NO
title: Mulliken charges:
elementType: O O O O C C C C C C C C C C C C C C C C C C H H H H H H H H H H H H H H H H H H H H H H H H H H H H H H H H H H
charge: -0.264260 -0.263773 -0.246978 -0.246169 -0.135293 -0.138447 -0.423175 -0.422008 -0.344930 -0.344956 -0.400725 -0.399067 -0.354868 -0.355558 0.223916 0.222964 -0.703272 -0.703774 -0.701105 -0.701140 -0.272734 -0.270292 0.226228 0.227134 0.197127 0.217641 0.198224 0.216082 0.190108 0.207835 0.192952 0.206990 0.204925 0.224047 0.204850 0.223432 0.193125 0.198788 0.193494 0.198336 0.226158 0.212344 0.218059 0.226812 0.212150 0.217964 0.211075 0.207204 0.217489 0.211827 0.206766 0.217359 0.250271 0.219369 0.248881 0.220599
chargesum: 0.00000
title: Mulliken charges with hydrogens summed into heavy atoms:
elementType: O O O O C C C C C C C C C C C C C C C C C C
charge: -0.264260 -0.263773 -0.246978 -0.246169 0.090935 0.088687 -0.008406 -0.007702 0.053012 0.054986 0.028247 0.029215 0.037044 0.036272 0.223916 0.222964 -0.046712 -0.046848 -0.065337 -0.065186 0.196906 0.199187
polarizability: 2.32001595e+02 -8.64884139e-03 2.09488996e+02 -3.08609086e+00 -2.49043685e-01 1.83908075e+02
1716.lowfreq: -6.3893 -0.0012 -0.0012 -0.0011 4.6784 6.7802 11.0867 17.7082 22.1681
frequency: 5.7605 17.7050 22.1422 25.9742 36.1381 41.0836 47.6708 58.8956 65.2106 71.8301 79.0514 91.3836 96.2196 109.9335 116.5053 126.3865 139.0843 147.6171 167.8291 191.6550 209.2389 216.3677 222.6104 224.8894 227.0250 237.0996 241.6999 271.9711 286.7034 294.4306 295.0644 295.9466 393.7098 396.2209 422.0859 428.1350 451.0595 489.8942 494.8762 630.2401 643.5773 704.8170 706.2219 726.7781 728.3831 775.1464 779.5162 782.1860 784.2031 815.2697 820.1205 848.2659 858.2594 890.5313 894.6341 913.2707 914.2974 944.8905 946.9010 983.3273 989.3430 997.1739 1025.8370 1033.3849 1035.2760 1047.9481 1048.1787 1072.0707 1073.0230 1082.7794 1083.4969 1091.4136 1099.0121 1101.0239 1106.0303 1112.5319 1121.7757 1126.9208 1145.7213 1148.3038 1202.2292 1207.8552 1208.9757 1240.3817 1241.0149 1242.5268 1259.4396 1260.5117 1272.2477 1273.2134 1289.3916 1290.1424 1293.9654 1295.4753 1327.0853 1328.9974 1329.5797 1330.8433 1341.6055 1352.2005 1358.8790 1360.8662 1368.9469 1381.9231 1387.0827 1389.7819 1393.7236 1394.1858 1453.6985 1455.8826 1456.3769 1457.2693 1461.4505 1464.0563 1465.3214 1466.8154 1472.1803 1475.1670 1476.5315 1476.8419 1477.3546 1477.7359 1483.3927 1484.2335 1485.2128 1486.2799 1634.3306 1635.8810 2958.0895 2960.3720 2965.5576 2966.4223 2968.9657 2969.6766 2973.6158 2974.9556 2977.2785 2977.4008 2985.0542 2985.6580 2997.2652 2998.9298 3009.2066 3012.5546 3012.8373 3020.4908 3020.9268 3021.3816 3037.7086 3038.2304 3047.6674 3048.1731 3063.0013 3065.4380 3070.6528 3071.4518 3075.7701 3075.8289 3076.4219 3076.5574 3080.1201 3091.2931
redmass: 3.5421 3.9735 5.4063 5.1738 3.9170 2.3468 2.3306 2.4510 1.7827 2.9765 2.7034 3.0200 2.3909 3.0284 2.6166 2.6839 3.5124 2.1385 2.3195 2.1143 2.6659 2.1400 1.4515 1.2900 1.9550 1.4995 1.8426 2.6156 2.7346 3.5390 3.0493 3.4344 3.2969 3.2946 3.0462 3.1027 3.0279 3.3285 3.3679 2.7313 2.3933 2.5594 2.6874 1.2580 1.2391 1.7930 1.3485 1.5248 2.1146 2.3278 1.7283 2.1177 2.5311 1.9767 2.0132 1.4785 1.4836 1.5651 1.7030 3.1702 3.7653 3.0484 2.2189 1.4790 1.4882 3.1771 3.1822 2.2914 2.1948 2.1727 2.0450 2.6903 2.2208 2.3679 2.3291 2.2500 1.8781 2.5611 2.5610 2.5819 1.1049 1.4715 1.4614 1.1892 1.2695 1.1597 1.2210 1.2233 1.2393 1.2315 1.2217 1.2215 1.0767 1.0749 1.4170 1.4346 1.4021 1.3778 1.2938 1.4873 1.5695 1.5549 1.5291 1.6866 1.2186 1.2238 1.2174 1.2187 1.0770 1.0782 1.0797 1.0796 1.0814 1.0752 1.0774 1.0766 1.0558 1.0517 1.0530 1.0574 1.0605 1.0434 1.0506 1.0497 1.0813 1.0851 9.0608 9.1738 1.0588 1.0579 1.0597 1.0597 1.0372 1.0372 1.0595 1.0589 1.0358 1.0359 1.0603 1.0604 1.0979 1.0981 1.0585 1.0892 1.0896 1.0687 1.0931 1.0976 1.1027 1.1026 1.1006 1.1008 1.1005 1.1005 1.0994 1.0993 1.1010 1.1010 1.0991 1.0991 1.1056 1.1036
irintensity: 0.3669 0.1814 1.0483 1.4457 0.0060 0.5975 0.2451 0.2855 0.1050 0.3053 0.5436 0.0568 0.4617 0.6474 0.0953 1.2344 0.0114 0.0306 2.8752 5.6738 0.2700 0.2355 1.1724 0.8709 1.3540 0.2300 1.5502 9.0555 3.6218 8.1048 2.0306 0.5132 1.9668 0.0254 1.7841 1.7262 18.7649 2.4235 0.6772 0.1937 1.0563 3.3308 2.3088 8.4585 8.6380 8.3067 10.2004 1.9133 11.0651 1.1904 0.0677 4.6123 9.5326 2.5766 9.1517 2.2806 19.0967 12.3086 48.6612 5.0764 0.1128 20.1176 10.1935 1.9232 2.1443 4.0660 3.3078 17.9207 14.5880 44.6624 20.5045 415.1005 16.2638 37.5682 32.9364 10.4742 29.8234 36.9199 49.1022 33.1533 3.1060 5.5619 5.1898 0.6795 9.5863 3.1792 5.9279 5.8119 6.3269 6.1028 0.3305 0.5545 2.6383 0.4077 1.8233 2.3274 6.4070 4.6724 19.7393 13.7318 0.9248 0.0902 22.0407 3.5943 11.5874 1.1576 13.9294 14.6036 0.0599 1.0317 2.7521 31.5898 1.8064 0.1621 7.7454 6.8042 8.3662 9.8042 11.6734 9.9365 7.6874 10.7544 14.3742 11.5183 17.6705 32.0842 256.8828 40.0986 3.9458 0.4438 49.3576 7.7862 30.3101 43.9113 109.6379 19.7991 33.9440 34.5234 50.1683 43.8555 0.3506 0.3451 0.7865 7.9837 10.6250 50.5093 3.4663 2.3306 6.0285 6.0616 27.7190 32.7595 165.1968 34.0546 38.1164 78.1594 68.8343 65.6900 88.5263 13.4217 10.1290 18.7523
temp: 298.150 k
press: 1.00000 atm
elementType: 8 8 8 8 6 6 6 6 6 6 6 6 6 6 6 6 6 6 6 6 6 6 1 1 1 1 1 1 1 1 1 1 1 1 1 1 1 1 1 1 1 1 1 1 1 1 1 1 1 1 1 1 1 1 1 1
symmnumber: 1
zpe: 1288576.8 jmol-1
zpe.correction: 0.490793 hartree
zpe.thermalcorrener: 0.519463 hartree
zpe.thermalcorrenthalpy: 0.520407 hartree
zpe.thermalcorrgfe: 0.425533 hartree
zpe.sumelectzpe: -1005.425762 hartree
zpe.sumelectthermal: -1005.397093 hartree
zpe.sumelectthermalent: -1005.396149 hartree
zpe.sumelectthermalfe: -1005.491023 hartree
dipole: -0.0641 1.2896 0.0447
dipole: 1.2920
quadrupole: -139.2080 -132.3854 -142.6907
quadrupole: 0.1762 -12.7614 -0.2537
quadrupole: -1.1133 5.7093 -4.5960 0.1762 -12.7614 -0.2537
hfenergy: -1005.9165555 hartree
pointgroup: C01 [X(C18H34O4)]
dipole: 0.1030601 0.4965472 -0.0344542 debye
polarizability: 230.4486152|-3.528127|210.0748481|-7.3819832|0.7079373|184.8752032 unknown
InChI: InChI=1S/C18H34O4/c1-5-9-11-15(7-3)17(19)21-13-14-22-18(20)16(8-4)12-10-6-2/h15-16H,5-14H2,1-4H3
charge 0 multiplicity 1
56 atoms
O  1.158335 -1.795124 -0.409846
O  -1.653909 -1.313416 0.41793
O  2.827349 -2.288265 1.137685
O  -3.470788 -1.35072 -1.037564
C  3.251192 -0.594088 -0.616431
C  -3.263939 0.483445 0.613649
C  3.534104 0.618226 0.318442
C  -3.172538 1.676351 -0.383264
C  2.269911 1.401523 0.736335
C  -1.743393 1.965301 -0.893604
C  4.573159 -1.233038 -1.127797
C  -4.702957 0.331236 1.180857
C  2.59408 2.62556 1.622652
C  -1.686831 3.183101 -1.84394
C  2.437931 -1.636267 0.140529
C  -2.851146 -0.798512 -0.0983
C  4.358973 -2.369254 -2.150005
C  -4.835414 -0.774875 2.248921
C  1.336001 3.423511 2.027829
C  -0.261403 3.475862 -2.359873
C  0.2699 -2.774575 0.273928
C  -1.137971 -2.545773 -0.238129
H  2.647498 -0.254808 -1.479303
H  -2.554182 0.650352 1.4458
H  4.228094 1.300061 -0.213465
H  4.066683 0.253193 1.219285
H  -3.567812 2.576592 0.129589
H  -3.84407 1.472464 -1.241086
H  1.727197 1.738182 -0.171584
H  1.572771 0.733006 1.281849
H  -1.069336 2.139566 -0.029428
H  -1.34327 1.075518 -1.421279
H  5.181682 -0.429064 -1.586466
H  5.140279 -1.612445 -0.255866
H  -4.999886 1.306121 1.614917
H  -5.392128 0.126975 0.33887
H  3.29782 3.292074 1.082882
H  3.125963 2.284093 2.533973
H  -2.082447 4.076516 -1.318363
H  -2.363134 3.003681 -2.704398
H  3.804528 -3.214588 -1.701998
H  3.786662 -2.015682 -3.027983
H  5.326985 -2.76143 -2.511055
H  -4.609274 -1.771174 1.825839
H  -4.144141 -0.600281 3.094625
H  -5.863458 -0.811499 2.652564
H  0.629436 2.787539 2.594255
H  0.803019 3.803461 1.134893
H  1.592817 4.291654 2.662278
H  0.14145 2.611194 -2.920533
H  0.429099 3.681468 -1.519322
H  -0.245234 4.352921 -3.032652
H  0.341423 -2.637026 1.366518
H  0.614484 -3.795287 0.02372
H  -1.164996 -2.418364 -1.334049
H  -1.794967 -3.392991 0.033468
