program: Gaussian 09
title: 000155815
version: EM64L-G09RevD.01
frameworkgroup: C1[X(C21H20N2O5)]
method: RPBEPBE
basis: SDD
operation: Freq
keyword: #p
keyword: freq=noraman
keyword: PBEPBE/SDD
title: #p freq=noraman PBEPBE/SDD
converged: YES YES NO NO
title: Mulliken charges:
elementType: O O O O O N N C C C C C C C C C C C C C C C C C C C C C H H H H H H H H H H H H H H H H H H H H
charge: -0.240387 -0.219953 -0.260476 -0.419918 -0.195375 -0.249877 -0.612434 0.307947 0.253999 0.043074 0.124499 -0.602553 -0.569292 0.274211 -0.383299 0.492913 -0.049502 -0.393514 -0.672796 -0.231432 -0.367031 -0.428754 0.126513 -0.233763 -0.218446 -0.391256 -0.239824 0.193748 0.243612 0.253507 0.303193 0.220791 0.248012 0.224568 0.234804 0.225540 0.210957 0.221501 0.263944 0.229499 0.231858 0.228099 0.280997 0.242974 0.231059 0.356300 0.329316 0.382446
chargesum: 0.00000
title: Mulliken charges with hydrogens summed into heavy atoms:
elementType: O O O O O N N C C C C C C C C C C C C C C C C C C C C C
charge: -0.240387 -0.219953 -0.260476 -0.037473 -0.195375 -0.249877 0.073182 0.307947 0.253999 0.043074 0.124499 -0.105434 -0.045309 0.274211 -0.135287 0.492913 -0.049502 -0.168945 -0.001496 -0.009930 -0.103086 -0.199255 0.126513 -0.001905 0.009653 0.132716 -0.008764 0.193748
polarizability: 3.28670278e+02 2.52125107e+01 2.80226413e+02 -1.32399358e+01 -8.72595361e+00 1.91760424e+02
1716.lowfreq: -5.3171 -1.6193 -0.0006 0.0004 0.0007 6.6483 15.7295 17.3680 21.3907
frequency: 15.3331 17.3167 21.2759 25.6918 31.1185 39.3030 53.3270 62.8806 65.7455 78.5946 93.7261 134.3107 141.9398 160.8882 187.3780 190.2735 195.3157 210.7405 233.6149 246.9715 265.2637 286.8258 292.0747 333.5112 343.0215 383.7755 388.1441 402.0968 426.7654 442.9597 455.7154 472.5440 489.6299 492.5649 523.2357 550.6046 567.3343 581.5401 589.3317 599.2301 610.3543 615.3754 620.3343 621.9401 630.5020 649.5990 700.7626 700.8886 710.7702 716.9584 734.5915 747.7639 770.1327 786.7712 797.2351 797.5100 825.7829 845.6696 852.5603 854.9968 872.4879 906.1495 938.9554 942.3217 967.0156 978.6216 989.5801 998.8392 1003.9104 1009.2762 1025.0385 1029.6557 1052.4168 1058.8950 1063.9643 1081.3837 1086.7883 1093.6920 1134.2209 1173.6981 1185.1348 1190.4964 1193.8260 1205.0145 1225.4124 1233.8754 1244.8623 1252.8159 1264.6216 1304.2935 1308.3461 1315.6401 1341.8505 1346.5879 1356.3575 1361.6476 1384.1267 1388.1923 1416.7413 1422.6109 1441.8370 1443.9595 1447.6989 1468.3421 1472.1468 1482.3534 1484.8502 1485.4476 1502.2151 1513.6889 1524.4310 1574.8544 1593.3938 1596.1966 1615.1905 1618.3685 1635.0652 1694.9036 2980.6380 2984.7931 2997.9548 3004.0966 3055.4720 3068.5502 3086.6440 3087.6584 3102.5053 3111.4311 3127.2976 3137.0502 3139.2669 3148.5705 3160.6585 3165.2634 3173.0828 3479.8387 3519.0842 3661.5318
redmass: 5.8606 4.8919 4.8135 6.4216 5.9281 8.0811 6.1519 6.1707 5.1180 2.8705 5.3788 6.3568 6.3900 5.0851 2.6150 4.0747 1.4364 6.8706 4.0326 5.2831 4.9336 3.8397 3.1721 5.1036 2.8873 5.0831 3.5205 2.8293 4.3909 4.9598 2.9384 2.5388 4.4869 2.6744 4.9585 3.9582 5.0222 4.8642 3.8032 3.2061 3.6660 2.8331 2.2699 2.4364 3.2615 4.2415 2.4280 1.1455 2.5005 2.2896 2.4168 1.7737 3.3236 1.5534 4.9732 4.8752 4.3546 1.4653 2.9427 1.3285 6.1732 1.4108 3.0726 1.3727 2.1021 1.3923 6.1331 1.3694 2.2211 3.1835 2.4801 2.8932 2.7042 2.0415 2.0532 1.8091 1.7881 1.9261 2.4952 1.0551 1.4284 1.1530 2.7085 2.4614 1.7520 1.2963 1.4968 1.2894 1.9130 1.6847 2.5046 1.4706 2.4091 1.6294 1.9738 1.9866 2.1175 1.9681 5.9486 3.9552 2.3509 1.1427 3.0876 1.1650 1.0536 1.1629 1.9345 3.1433 2.6600 1.6380 1.7619 3.0159 7.0262 6.0948 6.0669 8.2657 5.3880 9.0105 1.0353 1.0656 1.0699 1.0615 1.0998 1.0981 1.0994 1.0945 1.0933 1.0881 1.0861 1.0911 1.0862 1.0959 1.0915 1.1015 1.0982 1.0467 1.0643 1.1016
irintensity: 0.0909 0.3723 0.9046 0.0807 0.5870 0.8617 2.7870 5.1516 0.6943 1.4326 1.7023 3.4309 1.4040 2.4243 1.2376 1.1616 0.7032 7.3784 3.0155 0.7792 1.2959 1.3404 0.8122 18.0564 9.6836 10.0283 1.1417 0.1082 8.2974 0.5737 14.2595 25.6845 16.2864 14.3340 28.3793 11.8505 21.0286 16.2765 10.2732 35.1383 23.5712 70.7272 103.6376 23.7235 33.6746 24.7606 3.5696 102.7216 31.4745 46.8308 38.7717 37.7646 30.5765 4.5461 8.3456 4.4992 6.2910 1.0011 0.9530 0.2225 17.8689 5.1713 32.0468 2.6709 10.8349 0.2316 1.0776 8.1496 54.2014 338.4056 15.2465 59.7842 19.2632 30.4576 21.5428 15.9295 23.1598 16.2006 82.3810 0.0645 1.9361 10.7508 13.0737 22.3819 42.4967 10.9059 73.5341 3.5624 21.1614 24.0673 87.0809 6.4573 42.9778 62.6839 40.3132 3.6265 12.0906 10.8057 26.6254 150.7918 13.6984 37.6221 67.8935 22.8661 5.1105 12.1798 20.0188 14.7804 8.3376 221.4342 319.4967 81.2858 108.3213 4.8987 9.7120 13.4512 215.1069 190.9281 36.8664 37.6611 33.7398 29.0264 5.7023 34.0230 40.1226 5.3847 5.0072 9.2186 0.7449 10.4059 5.4049 32.5286 22.4660 24.7020 17.7454 46.6373 29.6795 71.3477
temp: 298.150 k
press: 1.00000 atm
elementType: 8 8 8 8 8 7 7 6 6 6 6 6 6 6 6 6 6 6 6 6 6 6 6 6 6 6 6 6 1 1 1 1 1 1 1 1 1 1 1 1 1 1 1 1 1 1 1 1
symmnumber: 1
zpe: 973868.6 jmol-1
zpe.correction: 0.370927 hartree
zpe.thermalcorrener: 0.397037 hartree
zpe.thermalcorrenthalpy: 0.397981 hartree
zpe.thermalcorrgfe: 0.310133 hartree
zpe.sumelectzpe: -1295.869004 hartree
zpe.sumelectthermal: -1295.842894 hartree
zpe.sumelectthermalent: -1295.841949 hartree
zpe.sumelectthermalfe: -1295.929798 hartree
dipole: -1.1703 -1.4318 -0.0221
dipole: 1.8494
quadrupole: -133.4555 -143.6569 -162.3518
quadrupole: 3.8212 -14.3326 1.8603
quadrupole: 13.0325 2.8312 -15.8637 3.8212 -14.3326 1.8603
hfenergy: -1296.2399307 hartree
pointgroup: C01 [X(C21H20N2O5)]
dipole: 0.472228 -0.5424434 -0.1101976 debye
polarizability: 328.9560086|-20.2405913|272.5006677|-21.1549432|24.8330566|199.2004383 unknown
InChI: InChI=1S/C21H20N2O5/c1-2-14-19(20(26)21(22)27)18-15(9-6-10-16(18)28-12-17(24)25)23(14)11-13-7-4-3-5-8-13/h3-10,24H,2,11-12,22H2,1H3
charge 0 multiplicity 1
48 atoms
O  -2.863488 -0.699443 0.734162
O  -2.648197 2.067266 0.177821
O  0.021927 3.158654 2.315854
O  -5.999151 -2.584213 0.327649
O  -4.720985 -1.556253 -1.329706
N  1.463025 0.229947 -0.785372
N  -2.150033 3.944582 1.954687
C  0.899731 1.390299 -0.239569
C  0.533967 -0.827517 -0.726691
C  -0.674374 -0.306452 -0.165978
C  -0.436162 1.100873 0.144939
C  2.820578 0.081814 -1.328012
C  1.639057 2.702841 -0.286759
C  -1.745062 -1.216952 0.059132
C  0.702637 -2.174975 -1.111147
C  3.811487 -0.588043 -0.371963
C  -1.446848 2.062895 0.59971
C  -1.610515 -2.563136 -0.346055
C  1.454414 3.450021 -1.637694
C  -0.399708 -3.029179 -0.925752
C  3.704815 -0.424954 1.030812
C  4.8845 -1.347361 -0.900221
C  -1.087901 3.110966 1.70224
C  4.662134 -1.008475 1.890553
C  5.844139 -1.928431 -0.04123
C  -3.965315 -1.578977 1.053663
C  5.73577 -1.759349 1.358437
C  -4.879519 -1.871109 -0.138751
H  2.758352 -0.495915 -2.269158
H  3.190873 1.085317 -1.602326
H  1.285587 3.329818 0.544508
H  2.717025 2.535949 -0.097397
H  1.648834 -2.550544 -1.510169
H  -2.436988 -3.269726 -0.228412
H  0.388233 3.675776 -1.816049
H  2.011932 4.403962 -1.625926
H  1.815479 2.852898 -2.495805
H  -0.326315 -4.081284 -1.220898
H  2.868482 0.143922 1.453018
H  4.971127 -1.486623 -1.985759
H  4.567534 -0.879034 2.974385
H  6.668623 -2.515412 -0.461285
H  -4.556637 -1.04342 1.814416
H  -3.629479 -2.538887 1.495816
H  6.476142 -2.212671 2.026828
H  -3.01383 3.783943 1.428986
H  -2.085307 4.649991 2.685836
H  -6.613992 -2.770698 -0.432566
