program: Gaussian 09
title: 000182056
version: EM64L-G09RevD.01
frameworkgroup: C1[X(C12H5Cl4NO2)]
method: RPBEPBE
basis: SDD
operation: Freq
keyword: #p
keyword: freq=noraman
keyword: PBEPBE/SDD
title: #p freq=noraman PBEPBE/SDD
converged: YES YES NO NO
title: Mulliken charges:
elementType: Cl Cl Cl Cl O O N C C C C C C C C C C C C H H H H H
charge: 0.032366 0.030673 -0.002256 0.008866 -0.185520 -0.176578 0.007915 0.244028 0.346772 0.234854 -0.305793 -0.355714 -0.348479 -0.331327 -0.127132 -0.097551 -0.072597 -0.202960 -0.113903 0.290075 0.277458 0.274710 0.306618 0.265473
chargesum: 0.00000
title: Mulliken charges with hydrogens summed into heavy atoms:
elementType: Cl Cl Cl Cl O O N C C C C C C C C C C C C
charge: 0.032366 0.030673 -0.002256 0.008866 -0.185520 -0.176578 0.007915 0.244028 0.346772 0.234854 -0.015718 -0.078256 -0.073769 -0.024709 -0.127132 -0.097551 -0.072597 0.062514 -0.113903
polarizability: 3.02184039e+02 5.11276278e+00 1.82569404e+02 -1.18829483e+01 -5.90779557e+00 1.10835122e+02
1716.lowfreq: -4.5955 -2.2472 0.0011 0.0014 0.0026 5.0368 25.7880 29.8220 42.6505
frequency: 25.7784 29.8190 42.6441 51.4834 79.2713 126.7448 156.0120 159.0563 175.3960 186.4116 190.5965 211.5953 220.5230 289.9656 297.6105 327.1973 356.9177 385.8286 426.8750 434.7254 439.7716 468.3814 497.1454 517.1182 578.7023 611.1615 628.9086 657.6266 668.3665 681.5027 706.1564 722.4624 738.2442 782.6323 823.2294 865.4802 876.4264 893.2982 904.0405 953.4732 1000.4143 1026.7930 1093.0834 1122.8502 1129.8281 1153.4566 1212.6962 1244.1533 1250.7416 1266.9153 1310.8597 1353.2463 1366.9674 1380.7409 1387.5562 1441.4508 1470.4262 1539.1721 1556.9353 1587.9421 1592.8778 3158.9411 3167.7220 3169.2117 3185.5487 3196.7884
redmass: 13.4071 16.1895 18.3324 16.3812 14.0789 8.7294 8.1806 11.0570 21.4513 24.2267 8.3201 8.3620 13.1549 10.5519 18.4999 8.1152 8.8122 11.7585 4.6088 4.7085 4.3603 6.4750 9.4913 6.7136 7.8374 5.9376 8.1934 7.4225 7.1030 6.5533 4.0135 8.2758 4.6574 7.6483 1.3706 6.4383 1.5062 1.5685 1.4348 1.3427 7.1438 5.0174 3.2283 2.2210 2.4424 1.4856 11.4619 1.6811 1.2229 2.5153 5.3198 4.9178 10.7680 4.3535 10.0742 2.5913 3.4167 9.3252 8.2331 7.6998 7.1066 1.0925 1.0904 1.0924 1.0926 1.0962
irintensity: 0.5003 0.0354 0.0417 0.4786 1.6646 0.5116 1.0296 1.1199 0.3835 0.3068 0.1772 1.2737 1.1513 1.0272 0.1755 0.7667 0.7327 7.0211 10.4440 16.4629 3.9727 2.6852 16.5869 3.4890 11.0042 9.8619 1.4812 27.5756 3.4060 3.3235 6.7918 15.8767 4.0103 11.1006 32.9543 57.0778 19.9554 8.2724 23.3187 1.2742 58.4252 11.4051 13.4361 47.9369 66.2833 2.5398 246.9926 10.6628 3.4792 17.0400 20.5646 7.9718 41.2828 63.7416 63.2056 225.3020 7.1207 51.1178 13.9193 11.4352 16.2377 0.5954 0.6230 0.2367 7.8529 0.4767
temp: 298.150 k
press: 1.00000 atm
elementType: 17 17 17 17 8 8 7 6 6 6 6 6 6 6 6 6 6 6 6 1 1 1 1 1
symmnumber: 1
zpe: 368186.0 jmol-1
zpe.correction: 0.140235 hartree
zpe.thermalcorrener: 0.157382 hartree
zpe.thermalcorrenthalpy: 0.158326 hartree
zpe.thermalcorrgfe: 0.092137 hartree
zpe.sumelectzpe: -2504.296754 hartree
zpe.sumelectthermal: -2504.279606 hartree
zpe.sumelectthermalent: -2504.278662 hartree
zpe.sumelectthermalfe: -2504.344851 hartree
dipole: -1.4171 -1.7326 -1.9069
dipole: 2.9405
quadrupole: -144.6620 -146.9008 -134.4082
quadrupole: 1.1142 -2.7001 -6.0289
quadrupole: -2.6717 -4.9105 7.5822 1.1142 -2.7001 -6.0289
hfenergy: -2504.4369884 hartree
pointgroup: C01 [X(C12H5Cl4N1O2)]
dipole: 0.5861852 0.8883591 -0.4533703 debye
dipolederiv: -0.2265516 -0.2505349 -0.0469213 -0.3972965 -0.6227856 -0.1076286 -0.0690217 -0.1176475 -0.0258924 -0.8285776 -0.0173255 -0.0746117 0.0099123 -0.0314177 -0.002106 -0.0816403 -0.0118852 -0.0168408 -0.2578118 0.1005814 0.2158315 0.162845 -0.1119383 -0.1876762 0.3565863 -0.1981113 -0.4810045 -0.8865419 0.0936507 -0.0765468 0.0940889 -0.0354933 -0.0011726 -0.0786781 0.000075 -0.0575331 -0.4331773 0.1288444 -0.1340498 0.2048535 -0.8764615 0.1135145 -0.2791261 0.1582497 -0.3253053 -0.5994618 -0.1315379 -0.2527466 -0.1150591 -0.5108919 -0.0683465 -0.2843719 -0.0044501 -0.3885653 0.7514675 0.246355 0.4879898 0.0340788 1.62468 -0.0397645 0.5879764 -0.0922917 0.5302415 0.6093082 -0.1961432 -0.012495 0.1320304 0.230204 0.0179683 0.0342025 -0.0826871 -0.0521887 0.0135957 0.0550398 -0.0007687 0.0360578 -0.0686308 0.0397002 0.0045857 0.0292687 0.0590265 -0.0169627 -0.2386678 -0.0915495 -0.1339958 -0.4782327 -0.0472692 0.014864 -0.1056507 -0.004815 -0.4632472 -0.2022344 -0.0380287 -0.2409872 -0.18907 -0.0435918 -0.1028523 -0.0218669 -0.0690925 -0.0936976 0.0141566 0.1468333 -0.141351 -0.0657223 -0.0599218 -0.0339321 -0.0148212 -0.152351 -0.0147064 -0.0585485 -0.0593765 0.0848004 -0.0658513 0.0916171 0.1019027 0.0125962 0.013744 -0.315711 0.2665823 0.0077463 -0.1082836 0.0439403 -0.0083556 0.0103118 0.1244854 -0.0215198 0.2440129 0.426802 0.0783893 0.4867321 1.0329276 0.1742719 0.0392961 0.20157 -0.0020345 1.2390627 -0.0850318 0.1141071 0.0575244 -0.3676981 -0.0276676 0.1455006 -0.046973 -0.0406506 -0.0441842 -0.1301987 -0.4750842 -0.175883 0.100093 0.3161098 -0.6174043 0.3494438 0.6979143 -0.2513005 0.0249992 0.0294148 0.0292159 -0.0700031 0.0389987 0.07831 0.0158514 0.0028163 1.2278757 -0.0999784 0.2378103 -0.0940691 -0.0536006 -0.0402338 0.2371802 -0.0611879 -0.0687022 0.0667865 0.0477837 -0.0007474 0.0609331 0.0383426 -0.0077417 0.0120106 -0.0140783 0.134768 0.0665149 -0.0139628 -0.0601946 -0.0167276 0.1282846 -0.0335344 -0.0740905 -0.0256811 0.0380818 0.0707483 0.0253672 0.0533773 0.0014781 0.1142246 -0.0656712 0.070531 -0.0305795 0.0483006 0.1059442 -0.0082054 -0.0000295 0.0328398 0.0911729 -0.008144 -0.0237914 -0.0259425 0.1606035 0.0366151 0.0022072 -0.0483493 -0.0037375 0.1439277 -0.043355 -0.0483492 -0.0376859 0.0209991 unknown
polarizability: 302.0547603|-3.716049|169.3697292|13.9987974|28.0735378|124.1640754 unknown
InChI: InChI=1S/C12H5Cl4NO2/c13-8-2-1-6(3-9(8)14)7-4-10(15)11(16)5-12(7)17(18)19/h1-5H
charge 0 multiplicity 1
24 atoms
Cl 3.469248 3.02168 0.578991
Cl 5.272842 0.27187 0.400124
Cl -3.817342 1.503788 2.297712
Cl -5.469987 0.774984 -0.45585
O  1.482317 -3.374637 0.156888
O  -0.138024 -2.519399 -1.200258
N  0.887177 -2.390296 -0.429872
C  0.630138 0.136846 -0.153393
C  -0.864947 0.204736 -0.244819
C  1.445811 -1.031423 -0.216202
C  1.309502 1.355544 0.115209
C  -1.571613 0.713601 0.876229
C  -1.587882 -0.110674 -1.42476
C  2.845368 -0.987232 -0.030752
C  2.706422 1.418953 0.275336
C  3.483295 0.240477 0.198621
C  -2.969667 0.878447 0.826724
C  -2.982907 0.076046 -1.477183
C  -3.679188 0.563564 -0.351101
H  0.727895 2.279426 0.181395
H  -1.040372 0.960461 1.800772
H  -1.065622 -0.493679 -2.302953
H  3.417078 -1.918229 -0.055824
H  -3.538543 -0.161754 -2.38853
