program: Gaussian 09
title: 000181880
version: EM64L-G09RevD.01
frameworkgroup: C1[X(CH2O4)]
method: RPBEPBE
basis: SDD
operation: Freq
keyword: #p
keyword: freq=noraman
keyword: PBEPBE/SDD
title: #p freq=noraman PBEPBE/SDD
converged: YES YES NO NO
title: Mulliken charges:
elementType: O O O O C H H
charge: -0.168650 -0.402733 -0.300867 -0.217131 0.317342 0.390788 0.381253
chargesum: 0.00000
title: Mulliken charges with hydrogens summed into heavy atoms:
elementType: O O O O C
charge: -0.168650 -0.011946 0.080385 -0.217131 0.317342
polarizability: 4.15315908e+01 4.37578021e-01 2.93092120e+01 -1.29747437e-02 -1.26668521e-02 1.12402854e+01
1716.lowfreq: -11.2347 -0.0014 -0.0008 0.0001 4.3743 10.5935 115.8498 139.2240 271.4725
frequency: 115.8366 139.2209 271.4719 446.8511 458.0464 587.3379 667.1471 805.4023 936.1902 1031.5936 1304.5343 1329.4701 1707.1742 3472.9771 3577.5138
redmass: 1.3078 4.5292 8.1139 1.0760 6.3740 8.4440 11.9728 5.4055 11.7355 3.0203 1.8872 1.2086 11.0105 1.0676 1.0655
irintensity: 153.2678 19.2654 5.1169 180.3907 20.7114 14.9376 30.4586 61.8475 37.8612 393.3612 49.7214 115.8826 324.9980 26.8400 72.9950
temp: 298.150 k
press: 1.00000 atm
elementType: 8 8 8 8 6 1 1
symmnumber: 1
zpe: 100790.0 jmol-1
zpe.correction: 0.038389 hartree
zpe.thermalcorrener: 0.044042 hartree
zpe.thermalcorrenthalpy: 0.044986 hartree
zpe.thermalcorrgfe: 0.009489 hartree
zpe.sumelectzpe: -339.707513 hartree
zpe.sumelectthermal: -339.701859 hartree
zpe.sumelectthermalent: -339.700915 hartree
zpe.sumelectthermalfe: -339.736412 hartree
dipole: 0.1602 -1.6191 0.0127
dipole: 1.6270
quadrupole: -14.8444 -33.9832 -28.0153
quadrupole: 4.5530 -0.0244 -0.0085
quadrupole: 10.7699 -8.3689 -2.4010 4.5530 -0.0244 -0.0085
hfenergy: -339.7459014 hartree
pointgroup: C01 [X(C1H2O4)]
dipole: 0.0613197 -0.6273993 -0.1112271 debye
dipolederiv: -0.6702119 -0.1891361 -0.1088271 -0.5644848 -0.4644453 -0.1397046 -0.1843801 -0.0889262 -0.1873516 -1.1200249 0.4563354 -0.0026874 0.4712603 -0.5255251 0.045345 0.0006935 0.043055 -0.4217644 -0.2922508 0.0621622 0.0190794 0.0999649 0.0422514 0.0893691 0.0273843 0.0841524 -0.3291536 -0.5674938 -0.0329725 -0.0415067 -0.0924309 -0.9931678 -0.1489585 -0.0533774 -0.1402192 -0.3441317 1.9904494 -0.1362728 0.1905439 0.2344393 1.6113395 0.2758044 0.2642483 0.2252533 0.4659251 0.3527054 -0.0934382 -0.0278886 -0.1053241 0.201247 -0.0581613 -0.0302188 -0.0564722 0.4055636 0.3068265 -0.0666779 -0.0287134 -0.0434246 0.1283002 -0.0636942 -0.0243498 -0.0668431 0.4109125 unknown
polarizability: 41.0096964|-0.3508124|28.6252784|3.9515846|3.3946195|12.4461133 unknown
InChI: InChI=1S/CH2O4/c2-1(3)5-4/h2,4H
charge 0 multiplicity 1
7 atoms
O  -0.542284 -0.641959 -0.343531
O  1.640809 -0.657671 -0.050274
O  -1.791472 0.227651 -0.339954
O  0.532511 1.40975 0.21036
C  0.54284 0.197623 -0.028727
H  2.45441 -0.132691 0.165035
H  -2.441913 -0.499602 -0.567409
