program: Gaussian 09
title: 000181876
version: EM64L-G09RevD.01
frameworkgroup: C1[X(C16H15F3O2)]
method: RPBEPBE
basis: SDD
operation: Freq
keyword: #p
keyword: freq=noraman
keyword: PBEPBE/SDD
title: #p freq=noraman PBEPBE/SDD
converged: YES YES NO NO
title: Mulliken charges:
elementType: F F F O O C C C C C C C C C C C C C C C C H H H H H H H H H H H H H H H
charge: -0.165949 -0.163422 -0.166952 -0.463676 -0.432259 0.014811 -0.426426 0.404860 0.400983 -0.453504 -0.698679 -0.417797 -0.364899 -0.374700 0.301204 -0.222220 -0.385689 -0.392585 -0.346984 0.282075 0.241335 0.204243 0.203288 0.299936 0.212559 0.237568 0.224559 0.251281 0.236849 0.287456 0.345189 0.236044 0.268496 0.218799 0.251125 0.353084
chargesum: 0.00000
title: Mulliken charges with hydrogens summed into heavy atoms:
elementType: F F F O O C C C C C C C C C C C C C C C C
charge: -0.165949 -0.163422 -0.166952 -0.118488 -0.079176 0.014811 -0.018896 0.404860 0.400983 -0.153568 -0.023993 -0.166516 -0.128049 -0.087245 0.301204 0.013824 -0.117193 -0.173786 -0.095859 0.282075 0.241335
polarizability: 2.01437295e+02 1.92280263e+01 1.69796555e+02 1.47749907e+01 7.41292192e+00 1.62153804e+02
1716.lowfreq: -9.2013 -5.0005 -3.0167 -0.0002 0.0002 0.0009 6.6712 16.0551 32.1142
frequency: -6.7674 15.9635 31.9584 47.1257 81.5870 101.9122 117.6945 131.6842 171.0488 186.3174 200.6058 226.1577 265.0545 268.7542 297.4982 309.8129 315.4234 334.1694 347.6436 355.6782 361.5847 382.6539 406.7124 409.4749 429.5396 445.3373 489.3259 517.1942 524.6310 543.8540 607.0131 612.6992 632.9110 636.1111 659.6245 704.8444 726.2199 739.7773 785.1563 804.2953 805.6410 810.7352 845.3261 873.6831 927.3636 930.6289 933.7026 943.1886 960.6285 981.7485 986.7690 989.4108 995.2221 1003.9925 1008.6529 1048.8637 1084.8803 1088.7454 1090.3327 1104.0185 1123.5491 1141.8199 1154.0104 1180.5587 1182.5072 1191.5345 1247.8329 1250.6051 1288.4357 1305.6550 1307.0784 1322.9589 1341.0656 1384.3179 1390.4870 1394.5189 1421.1769 1426.3747 1458.8696 1470.4542 1478.5965 1489.5518 1501.5712 1595.4010 1597.6479 1614.0210 1626.5887 2962.7191 2991.9856 3024.9322 3085.7012 3095.4640 3111.2998 3137.8309 3140.5897 3157.5052 3159.9327 3161.6480 3177.3179 3183.8453 3557.4937 3582.6067
redmass: 16.3443 7.3457 4.0284 4.8706 3.7409 6.7901 3.4673 3.2270 3.2556 3.4683 3.0815 1.9838 6.3173 4.3217 4.2657 3.4396 1.5499 3.4846 5.6258 1.1463 3.8542 5.2608 4.3777 2.9666 4.4571 5.3272 4.1200 4.1898 7.4388 3.4178 8.1123 5.7081 6.8207 6.4789 6.4510 2.1129 4.1867 4.5880 1.8662 1.6803 1.8223 1.8789 1.4790 2.1796 2.0290 1.4777 1.5368 1.9376 2.3565 1.4223 4.9154 5.8824 1.5554 2.8540 6.5871 3.2787 2.4292 2.6852 1.5154 1.6034 1.7881 1.5022 1.6615 2.2373 1.1854 1.1003 2.6130 1.3210 3.4006 1.4317 1.3789 1.4788 1.6292 6.6464 4.4406 1.3416 3.1062 3.2156 1.0951 1.0408 2.4246 1.0546 2.6785 6.7144 6.1233 6.3359 6.3443 1.0613 1.0362 1.0988 1.0997 1.1002 1.0876 1.0956 1.0870 1.0924 1.0930 1.0888 1.0977 1.0960 1.0658 1.0660
irintensity: 0.0023 0.3206 0.4454 0.1201 0.3942 0.2255 0.1786 0.3660 0.5036 1.5905 0.0380 1.3881 0.1548 9.0664 13.0216 8.4978 73.1329 41.1686 5.6097 137.7888 56.6086 4.7840 6.7970 0.3778 2.4625 1.6166 3.1175 11.2973 1.5361 24.3783 40.4545 10.5231 1.8970 5.1535 0.8536 30.7607 8.8336 24.2983 18.2359 20.0552 12.6971 68.3532 32.1020 32.0758 18.1311 15.0771 19.1322 34.1643 0.4545 1.4180 159.3995 7.8816 27.5898 3.3696 157.9322 83.3488 29.1561 21.1991 30.4978 22.8717 3.0685 225.6623 47.7615 125.6368 11.6720 14.3172 27.7824 6.5180 188.8252 18.8100 22.5961 9.5096 42.7734 8.4847 23.3842 9.4076 11.6274 15.8666 1.4690 9.0276 8.2893 11.1705 94.7112 10.5351 12.0648 3.1002 41.9698 44.8452 32.7764 21.2383 32.4781 30.3197 18.4582 12.8934 6.2846 1.9150 7.8933 3.5480 7.2945 3.5214 7.6771 40.6049
temp: 298.150 k
press: 1.00000 atm
elementType: 9 9 9 8 8 6 6 6 6 6 6 6 6 6 6 6 6 6 6 6 6 1 1 1 1 1 1 1 1 1 1 1 1 1 1 1
symmnumber: 1
zpe: 712116.9 jmol-1
zpe.correction: 0.271231 hartree
zpe.thermalcorrener: 0.290103 hartree
zpe.thermalcorrenthalpy: 0.291047 hartree
zpe.thermalcorrgfe: 0.223330 hartree
zpe.sumelectzpe: -1067.150838 hartree
zpe.sumelectthermal: -1067.131966 hartree
zpe.sumelectthermalent: -1067.131022 hartree
zpe.sumelectthermalfe: -1067.198739 hartree
dipole: -1.5984 3.9447 3.8429
dipole: 5.7344
quadrupole: -133.6166 -117.3882 -111.6167
quadrupole: 8.4064 -1.5216 -4.4933
quadrupole: -12.7428 3.4856 9.2571 8.4064 -1.5216 -4.4933
hfenergy: -1067.4220688 hartree
pointgroup: C01 [X(C16H15F3O2)]
dipole: 0.6649689 1.7129235 -1.3090896 debye
polarizability: 200.5734513|-17.7203806|168.6385257|17.5819898|-7.7154536|164.1756773 unknown
InChI: InChI=1S/C16H15F3O2/c1-2-15(21,11-6-8-14(20)9-7-11)12-4-3-5-13(10-12)16(17,18)19/h3-10,20-21H,2H2,1H3
charge 0 multiplicity 1
36 atoms
F  -4.622577 -1.553304 -0.86973
F  -2.778844 -2.619375 -0.08845
F  -3.92688 -1.215839 1.263478
O  0.362074 1.245316 2.051175
O  4.670833 -2.718251 -0.403258
C  0.705911 1.365427 0.609978
C  1.322989 2.773973 0.350013
C  -0.583583 1.12143 -0.208105
C  1.736437 0.255738 0.33311
C  -1.418886 0.045202 0.18041
C  2.544629 3.084452 1.23627
C  -0.967613 1.908299 -1.322655
C  2.087607 -0.066125 -1.000199
C  2.378778 -0.433568 1.391413
C  -2.607673 -0.229926 -0.528664
C  -2.158615 1.627435 -2.031063
C  -2.987955 0.557992 -1.640025
C  3.062178 -1.047456 -1.27819
C  3.350047 -1.420253 1.128488
C  3.693892 -1.725527 -0.2074
C  -3.467107 -1.375395 -0.074737
H  1.622617 2.844473 -0.713668
H  0.535921 3.539898 0.513867
H  -1.125366 -0.567334 1.039205
H  2.900077 4.114566 1.053445
H  3.377522 2.391405 1.025632
H  2.291604 2.988113 2.306441
H  -0.346902 2.74913 -1.647222
H  1.588852 0.436765 -1.837128
H  2.102436 -0.194142 2.421091
H  -0.335761 1.918557 2.256962
H  -2.440923 2.246589 -2.888885
H  -3.911737 0.337128 -2.182211
H  3.318243 -1.288525 -2.318266
H  3.846741 -1.960413 1.939806
H  4.828036 -2.872854 -1.367629
