program: Gaussian 09
title: 000181602
version: EM64L-G09RevD.01
frameworkgroup: C1[X(C9H14N2O2)]
method: RPBEPBE
basis: SDD
operation: Freq
keyword: #p
keyword: freq=noraman
keyword: PBEPBE/SDD
title: #p freq=noraman PBEPBE/SDD
converged: NO YES NO NO
title: Mulliken charges:
elementType: O O N N C C C C C C C C C H H H H H H H H H H H H H H
charge: -0.246971 -0.271780 -0.078707 -0.385711 -0.342470 -0.084685 -0.103771 -0.149039 -0.444178 -0.465605 -0.471197 0.236149 -0.780674 0.279287 0.249679 0.322764 0.277566 0.230390 0.234370 0.247192 0.226921 0.239879 0.230223 0.331274 0.253135 0.253210 0.212750
chargesum: 0.00000
title: Mulliken charges with hydrogens summed into heavy atoms:
elementType: O O N N C C C C C C C C C
charge: -0.246971 -0.271780 -0.078707 -0.054437 -0.063183 0.164994 0.218993 0.128527 0.020582 0.008507 -0.001096 0.236149 -0.061579
polarizability: 1.38583811e+02 -2.85531077e+00 9.90166353e+01 -4.55604179e+00 -1.80939977e+00 9.02246611e+01
1716.lowfreq: -14.8717 -6.5606 0.0008 0.0009 0.0009 12.8177 32.3094 70.1659 84.8298
frequency: 32.1589 70.1411 84.8174 97.1808 146.5809 220.6757 279.7705 311.9539 366.6183 382.0202 437.5394 504.1776 539.9119 582.0456 599.1471 645.2407 649.5063 676.8730 743.1462 754.8523 788.1366 816.6805 838.7310 866.1053 894.4084 907.9368 932.4584 936.4889 967.5081 980.6364 999.0492 1006.2166 1009.5359 1036.7936 1042.0165 1050.5835 1084.8154 1134.1737 1157.6027 1165.6068 1192.6230 1202.8433 1213.6409 1231.1834 1238.5706 1245.2958 1263.2600 1280.5816 1285.7169 1296.2129 1305.9489 1315.8281 1339.8583 1387.1772 1450.4862 1453.8548 1465.5511 1467.1650 1480.3124 1484.3098 1616.8545 2996.5592 2998.9456 3007.8838 3018.9884 3058.8750 3065.1210 3075.5678 3086.1033 3093.1939 3095.8494 3097.3271 3100.7509 3133.5811 3527.7142
redmass: 5.2994 1.3511 4.0062 1.9657 2.3823 6.9162 3.3431 3.5010 2.4882 2.9366 2.5263 3.7459 5.3315 2.8537 4.9269 1.3895 2.7540 3.1278 2.9817 3.9801 4.9484 2.7893 2.2050 3.7542 3.0796 2.6739 2.5812 3.7611 2.3182 1.7146 2.4744 2.3387 2.9311 1.8108 1.6390 1.8180 1.8390 2.5655 1.7050 2.0598 1.4485 1.3486 1.2889 1.4331 1.2931 1.5091 1.5941 1.4229 1.5287 1.3847 1.3610 1.3309 1.6567 1.2284 1.0461 1.0846 1.1787 1.0899 1.8204 1.0860 6.9061 1.0358 1.0607 1.0622 1.0641 1.0894 1.1043 1.1014 1.0872 1.0946 1.0995 1.0984 1.1003 1.0929 1.0781
irintensity: 4.1714 3.7422 5.9034 1.8189 1.0784 4.2578 0.9570 0.7793 6.0134 2.9977 4.9177 23.2876 8.8213 22.8586 2.1328 55.2542 7.0750 7.4703 4.5535 13.3037 5.3086 13.0790 4.0316 2.3393 3.5488 7.7235 43.1017 0.5901 5.9542 4.1148 8.2799 18.4582 28.4520 2.5021 12.2191 3.0246 14.1993 1.2676 6.6433 3.9600 2.4931 15.2338 11.5904 7.3325 6.5466 12.8595 32.6497 3.0307 14.6324 3.4878 2.7668 4.0692 34.3315 66.7727 14.7570 8.1143 127.9690 17.1998 240.8966 10.8826 213.2582 10.6376 56.2713 26.0831 57.8082 46.1778 16.7119 6.3216 5.0155 5.5124 57.9280 15.5701 18.6084 12.0680 33.4944
temp: 298.150 k
press: 1.00000 atm
elementType: 8 8 7 7 6 6 6 6 6 6 6 6 6 1 1 1 1 1 1 1 1 1 1 1 1 1 1
symmnumber: 1
zpe: 594027.1 jmol-1
zpe.correction: 0.226253 hartree
zpe.thermalcorrener: 0.237636 hartree
zpe.thermalcorrenthalpy: 0.238580 hartree
zpe.thermalcorrgfe: 0.187933 hartree
zpe.sumelectzpe: -610.284587 hartree
zpe.sumelectthermal: -610.273204 hartree
zpe.sumelectthermalent: -610.272260 hartree
zpe.sumelectthermalfe: -610.322908 hartree
dipole: 2.2021 -3.9720 -0.4869
dipole: 4.5676
quadrupole: -78.0625 -85.4024 -72.5050
quadrupole: 8.0618 -3.5326 -1.6304
quadrupole: 0.5941 -6.7458 6.1517 8.0618 -3.5326 -1.6304
hfenergy: -610.5108403 hartree
pointgroup: C01 [X(C9H14N2O2)]
dipole: -0.465729 -1.4831994 -0.9014288 debye
polarizability: 134.7045803|13.0282691|97.6806811|2.263594|5.886499|95.4398456 unknown
InChI: InChI=1S/C9H14N2O2/c1-5(12)10-8-7-4-11-3-2-6(13-7)9(8)11/h6-10H,2-4H2,1H3
charge 0 multiplicity 1
27 atoms
O  -1.724466 1.411755 0.458206
O  2.921385 1.660894 1.432001
N  -0.735516 -0.970791 -0.830882
N  1.756085 0.076745 0.191246
C  -0.578964 -0.67551 0.65687
C  -1.937676 0.004847 0.987764
C  0.443445 0.475292 0.687728
C  -0.427809 1.351731 -0.271324
C  -0.602911 0.412834 -1.484808
C  -2.987875 -0.755942 0.144139
C  -2.129612 -1.51914 -0.932289
C  2.926454 0.696615 0.607528
C  4.214359 0.134512 0.011292
H  -0.34262 -1.579637 1.236997
H  -2.19745 0.098206 2.055102
H  0.555344 0.959888 1.669914
H  -0.099231 2.380751 -0.463122
H  -1.509588 0.676768 -2.057219
H  0.269225 0.437384 -2.16371
H  -3.692653 -0.034592 -0.302681
H  -3.568081 -1.454831 0.77412
H  -2.09636 -2.600659 -0.70743
H  -2.507982 -1.400819 -1.960555
H  1.783521 -0.702252 -0.471592
H  4.766184 0.9504 -0.486179
H  4.85542 -0.240979 0.827751
H  4.046772 -0.680271 -0.714267
