program: Gaussian 09
title: 000181441
version: EM64L-G09RevD.01
frameworkgroup: C1[X(C12H5Cl5O)]
method: RPBEPBE
basis: SDD
operation: Freq
keyword: #p
keyword: freq=noraman
keyword: PBEPBE/SDD
title: #p freq=noraman PBEPBE/SDD
converged: NO NO NO NO
title: Mulliken charges:
elementType: Cl Cl Cl Cl Cl O C C C C C C C C C C C C H H H H H
charge: -0.013848 -0.045687 -0.000891 0.004471 0.012532 -0.384324 0.319462 0.411795 -0.365380 -0.380269 -0.336008 -0.340088 -0.238467 -0.231765 0.460591 -0.085531 -0.182283 -0.090839 0.274793 0.274442 0.282272 0.286902 0.368122
chargesum: 0.00000
title: Mulliken charges with hydrogens summed into heavy atoms:
elementType: Cl Cl Cl Cl Cl O C C C C C C C C C C C C
charge: -0.013848 -0.045687 -0.000891 0.004471 0.012532 -0.016203 0.319462 0.411795 -0.090587 -0.105827 -0.336008 -0.057816 -0.238467 -0.231765 0.460591 -0.085531 0.104620 -0.090839
polarizability: 2.69328523e+02 5.96169049e+00 1.45032856e+02 6.89805554e+00 -1.33002117e+00 1.43896728e+02
1716.lowfreq: -21.1903 -0.0019 -0.0011 0.0022 1.9749 6.9169 7.1868 38.1391 42.2853
frequency: -21.1301 38.1381 42.2675 77.1408 100.5722 140.3259 154.0001 173.4136 188.0597 192.0652 195.4721 217.6991 240.2457 271.3892 313.6816 340.9432 345.2914 354.1826 418.3024 433.3395 445.2018 460.4517 475.0495 491.0130 536.4822 541.5381 624.4393 634.3684 653.7456 687.5296 708.8242 715.6841 757.4444 795.3632 866.1773 869.1046 876.0363 890.3233 893.3590 1018.5015 1051.8520 1083.1807 1122.0279 1142.7432 1223.9818 1239.9953 1250.2302 1286.7211 1325.6014 1352.4022 1365.1472 1393.4433 1436.8000 1481.4019 1542.2906 1560.8194 1584.6222 1607.2452 3165.7843 3167.7176 3171.3524 3178.1753 3494.8010
redmass: 17.8417 17.3642 14.2216 20.2567 12.3627 27.1781 10.1814 17.7366 16.3478 5.1234 14.2671 6.3182 15.1783 7.6422 26.3188 7.8370 11.5649 17.2724 5.3320 12.1036 1.1081 4.1334 5.4838 5.3699 6.3064 8.5724 7.7049 5.4943 7.9215 8.2507 4.2628 4.6808 7.6320 8.2827 1.4432 2.6041 2.4004 1.4119 1.3979 8.6969 3.3184 2.5496 2.6181 1.5258 1.7458 1.2514 1.8847 3.1781 5.5710 8.5593 4.0688 5.6886 3.0318 5.0749 9.6753 6.5290 8.2964 8.1953 1.0926 1.0928 1.0936 1.0931 1.0649
irintensity: 0.0807 0.0652 0.0163 0.1498 0.0005 0.0638 0.0358 0.1987 0.0541 0.2995 1.0199 0.2899 0.1760 7.4011 0.0345 3.8446 3.0549 2.4156 0.3313 8.5244 136.3041 17.1535 2.7133 1.7092 32.0354 31.7492 1.3500 11.7542 12.3853 10.7115 8.7923 10.9360 71.0391 24.9785 10.0420 27.1110 4.9816 6.6081 13.6436 80.9034 2.1990 24.1159 64.0908 185.1987 67.1044 7.4578 43.5371 15.0442 45.6443 25.9735 33.2747 6.5762 266.3121 26.4069 2.0218 46.5679 7.9020 0.2331 0.1414 0.0519 0.2003 1.3826 80.1605
temp: 298.150 k
press: 1.00000 atm
elementType: 17 17 17 17 17 8 6 6 6 6 6 6 6 6 6 6 6 6 1 1 1 1 1
symmnumber: 1
zpe: 349342.5 jmol-1
zpe.correction: 0.133058 hartree
zpe.thermalcorrener: 0.149156 hartree
zpe.thermalcorrenthalpy: 0.150100 hartree
zpe.thermalcorrgfe: 0.087805 hartree
zpe.sumelectzpe: -2834.533325 hartree
zpe.sumelectthermal: -2834.517227 hartree
zpe.sumelectthermalent: -2834.516283 hartree
zpe.sumelectthermalfe: -2834.578578 hartree
dipole: -0.0730 1.1444 -1.0321
dipole: 1.5428
quadrupole: -144.9302 -137.1490 -138.8101
quadrupole: -9.7092 2.3483 0.1299
quadrupole: -4.6337 3.1474 1.4863 -9.7092 2.3483 0.1299
hfenergy: -2834.6663827 hartree
pointgroup: C01 [X(C12H5Cl5O1)]
dipole: 0.0247695 -0.1164796 -0.5951832 debye
dipolederiv: -0.3005911 -0.2488342 0.052475 -0.2850098 -0.5765451 0.1120552 0.0611082 0.1135818 -0.0612003 -0.3845524 0.0762016 0.2540202 0.0906943 -0.0754597 -0.1321093 0.3079308 -0.1322521 -0.57403 -0.276367 -0.0359363 -0.2513481 -0.0565316 -0.0446303 -0.0948332 -0.361484 -0.0910574 -0.5773859 -0.2896627 -0.2674952 0.0565882 -0.3840237 -0.5435564 0.109221 0.0802155 0.1080904 -0.0443157 -0.8284606 0.0318762 -0.0010375 0.0753671 -0.0629348 0.0083336 -0.0099892 0.0085774 -0.0212097 -1.4795438 0.0966805 0.1026944 0.0984432 -0.3608392 0.0446901 0.0679845 0.0476511 -0.1068877 0.2098405 -0.0471879 0.0259654 -0.0682999 -0.0684189 0.0185969 -0.0175926 0.0216694 0.0199375 0.3858625 -0.1411547 0.027619 -0.0829602 -0.1533053 0.0149524 0.0189793 0.0154119 -0.0851348 -0.1952941 0.0029183 -0.0404087 -0.0070118 -0.0538442 0.0065681 -0.0368493 -0.0023217 -0.110365 -0.2107079 0.0029011 -0.0450124 0.0105561 -0.0571954 -0.028442 0.0491299 -0.0257744 -0.1230029 0.2882547 0.4352641 -0.0905875 0.3475342 0.8520093 -0.1886288 -0.0722059 -0.1905789 -0.0216897 -0.1927346 -0.0742687 0.0166702 -0.0142242 -0.1336876 0.0136352 0.0056839 0.0138817 -0.0651325 0.2028054 -0.0732248 -0.2736309 -0.1468204 -0.0257422 0.2081658 -0.6566792 0.2305272 0.8083485 0.2110621 0.04855 0.3104752 0.1373884 -0.0430328 0.1764301 0.7070909 0.1528061 0.8870248 1.2000693 -0.0879833 -0.0670599 -0.0973497 0.0883713 -0.0932445 -0.0753158 -0.0927588 -0.3682117 0.0685438 0.5262078 -0.1081955 0.541576 0.7818749 -0.1723796 -0.1131418 -0.1729771 -0.0094894 -0.4094911 -0.0850476 0.0202095 -0.0943472 -0.1992918 0.0334439 0.0213317 0.0341524 -0.0463577 1.1765346 -0.2082306 0.0340726 -0.1353921 -0.0278868 -0.0037286 0.019417 -0.0029781 -0.0503131 0.1006024 0.0119389 0.052043 0.0120623 0.1305366 -0.0297665 0.0759075 -0.0268912 0.0345406 0.1018811 -0.0097859 -0.0516613 -0.0195654 0.1400974 -0.0145918 -0.073379 -0.0178403 0.0326372 0.0845495 0.0362083 -0.0065356 0.062757 0.0253678 0.0227861 -0.0120907 0.0229165 0.1332125 0.0601855 0.0185622 -0.0029499 0.0215879 0.0454605 0.0240332 -0.0038276 0.0239522 0.1589399 0.477214 -0.0081599 -0.0144055 -0.0064303 0.3626527 -0.0351873 0.0177759 -0.037788 0.1900849 unknown
polarizability: 268.6646787|12.4299472|143.9473098|-3.4698358|0.7150744|145.6461191 unknown
InChI: InChI=1S/C12H5Cl5O/c13-7-4-9(15)8(14)3-6(7)5-1-10(16)12(18)11(17)2-5/h1-4,18H
charge 0 multiplicity 1
23 atoms
Cl -0.682899 2.82597 -0.586363
Cl 3.643217 -0.791703 -2.678869
Cl 3.615253 0.349041 2.752011
Cl -4.005696 -2.559995 0.536643
Cl -5.557171 0.295602 -0.034528
O  4.831416 -0.294267 0.09765
C  0.594223 -0.008517 -0.013507
C  -0.902294 0.081744 -0.025182
C  1.312978 0.191644 1.191993
C  1.302315 -0.310716 -1.202224
C  -1.600971 1.292006 -0.266082
C  -1.679267 -1.079155 0.216612
C  2.701445 -0.403575 -1.159237
C  2.714707 0.092127 1.206986
C  3.447668 -0.207458 0.030941
C  -3.087585 -1.034694 0.218272
C  -3.00759 1.357363 -0.268573
C  -3.753152 0.186758 -0.025072
H  0.781799 0.428539 2.118322
H  0.770045 -0.465858 -2.144644
H  -1.173076 -2.030106 0.407647
H  -3.52202 2.303359 -0.456822
H  5.206255 -0.504607 -0.799676
