program: Gaussian 09
title: 000176829
version: EM64L-G09RevD.01
frameworkgroup: C1[X(C18H21NO3)]
method: RPBEPBE
basis: SDD
operation: Freq
keyword: #p
keyword: freq=noraman
keyword: PBEPBE/SDD
title: #p freq=noraman PBEPBE/SDD
converged: YES YES NO NO
title: Mulliken charges:
elementType: O O O N C C C C C C C C C C C C C C C C C C H H H H H H H H H H H H H H H H H H H H H
charge: -0.302097 -0.313454 -0.314433 -0.419575 0.301970 -0.746327 -0.689222 -0.691891 0.326548 -0.485688 0.514415 -0.517776 -0.426767 0.342524 -0.395797 -0.196821 0.352485 -0.352254 -0.385420 -0.205177 -0.193714 -0.251278 0.220941 0.227668 0.220447 0.263686 0.211655 0.204102 0.209762 0.204992 0.263412 0.326331 0.242164 0.218680 0.312591 0.236121 0.259199 0.228613 0.261815 0.255067 0.226371 0.227722 0.228411
chargesum: 0.00000
title: Mulliken charges with hydrogens summed into heavy atoms:
elementType: O O O N C C C C C C C C C C C C C C C C C C
charge: -0.302097 -0.313454 -0.314433 -0.093244 0.301970 -0.077271 -0.009778 -0.013725 0.326548 -0.024844 0.514415 -0.205186 -0.190646 0.342524 -0.136598 0.031793 0.352485 -0.090439 -0.130353 0.021193 0.034008 -0.022868
polarizability: 2.02520020e+02 -2.03653757e+01 2.54215320e+02 -4.01323375e+00 -4.64047087e+00 1.75272695e+02
1716.lowfreq: -5.0393 -0.0007 -0.0005 0.0002 3.7184 6.6923 11.3818 22.5667 24.4697
frequency: 11.3767 22.4896 24.3694 38.0558 43.3745 68.5425 80.3127 103.1629 128.3830 159.0143 187.9552 196.5218 221.2501 241.2028 250.0799 260.3756 268.5879 297.6146 308.2568 322.4319 334.4148 371.0138 398.1346 410.4894 413.3364 447.0383 453.3070 479.3719 500.8102 523.1561 530.2362 563.6921 583.5829 612.8909 640.4350 652.7678 689.8915 698.4093 704.7874 724.6146 758.3914 762.8658 794.6996 818.0457 833.5987 868.7010 894.9739 901.9104 908.1710 914.5668 926.8517 928.2795 936.8072 954.6808 967.2890 977.0667 984.9416 986.5021 986.9150 993.1129 1007.7709 1019.9990 1036.4641 1041.6996 1077.9860 1086.7134 1141.2604 1167.2540 1171.5439 1172.1774 1173.8659 1201.1625 1234.3457 1236.3785 1238.9609 1249.3324 1264.3038 1302.0914 1311.0868 1348.7107 1375.5468 1377.5074 1381.5688 1389.7736 1401.8674 1434.1735 1443.1778 1450.9177 1457.6130 1463.5730 1468.3490 1471.0148 1472.2709 1479.7904 1483.9451 1484.8727 1501.5768 1594.3288 1594.7442 1607.8342 1612.9345 1661.8539 2976.6719 2983.8028 2988.2517 3032.1448 3068.7898 3079.4657 3083.6128 3095.7374 3100.2337 3104.3398 3105.6428 3129.3000 3130.0030 3139.3196 3149.4112 3153.5050 3156.4403 3165.2637 3171.9938 3174.2678 3553.6844
redmass: 4.8503 4.1988 3.5697 4.2211 4.6120 4.7948 6.5775 3.8118 4.0258 5.6562 1.0400 4.2807 4.4980 2.6310 1.3403 4.5132 1.0566 4.1156 3.3022 3.6891 2.3913 4.2844 2.4918 2.9243 2.9852 3.1105 2.9929 3.3591 3.0699 1.2640 3.2834 7.6458 5.3061 6.5098 5.7702 5.7361 2.4228 2.5270 6.5140 3.8432 3.2687 1.8048 2.0244 3.0861 1.2949 5.0135 2.3532 1.4416 1.6217 1.6971 1.6589 1.7888 2.2101 1.2030 1.3639 1.3365 1.7597 2.5578 5.8815 2.1363 4.9983 2.0833 1.3878 1.4716 1.5039 1.5432 1.9361 1.1288 1.1844 1.6689 1.2975 2.5978 2.5681 3.0174 1.2460 3.4413 3.5601 1.3106 1.3023 1.2359 1.2049 1.2091 7.6886 8.6857 1.2261 2.7570 2.3649 1.0463 1.2112 1.2930 1.0647 2.2562 1.0498 2.3752 1.0734 1.2559 1.0746 6.4003 6.4712 6.4901 6.6284 8.7902 1.0362 1.0352 1.0361 1.0586 1.1003 1.1002 1.0996 1.0982 1.1004 1.0997 1.1071 1.0873 1.0848 1.0892 1.0930 1.0929 1.0929 1.0961 1.0978 1.1003 1.0771
irintensity: 0.3992 0.1133 1.6852 0.4029 0.6923 0.6207 4.8884 3.5941 0.9544 0.5882 0.1363 3.8316 2.2919 3.4448 0.7268 9.7711 0.2295 0.9418 1.5353 6.2895 0.1679 1.2739 8.6512 0.6604 3.8056 7.9663 0.6706 18.4964 5.3676 93.8882 2.9753 1.1420 3.4332 1.4046 2.3487 7.1022 42.0065 5.2782 23.8929 25.4727 28.1575 74.5370 37.4351 29.0791 2.0896 14.0791 37.5361 20.5147 6.3991 0.3223 1.7159 27.8567 15.0432 0.3549 0.1290 1.5243 1.3220 1.8397 4.3110 10.2461 288.0197 14.8042 0.0592 3.6530 11.4141 5.9295 11.0567 23.4358 30.4556 72.0518 73.0481 175.7817 44.6893 23.6935 15.1782 222.9667 146.8731 1.4944 0.6334 8.6705 29.3791 33.8597 10.2530 2.9239 51.7398 50.9945 11.9059 0.5532 29.8116 222.0639 21.9203 169.6600 2.0833 21.1031 16.0038 119.6738 6.2877 170.9279 10.3124 17.7221 3.1693 215.8645 24.7160 32.3497 20.4109 35.5114 22.7072 28.3955 26.5478 47.8369 3.2279 26.6696 8.6002 6.0919 1.6567 12.1224 25.6702 3.7392 26.9544 14.3643 12.1984 6.6348 34.2803
temp: 298.150 k
press: 1.00000 atm
elementType: 8 8 8 7 6 6 6 6 6 6 6 6 6 6 6 6 6 6 6 6 6 6 1 1 1 1 1 1 1 1 1 1 1 1 1 1 1 1 1 1 1 1 1
symmnumber: 1
zpe: 919320.2 jmol-1
zpe.correction: 0.350151 hartree
zpe.thermalcorrener: 0.371690 hartree
zpe.thermalcorrenthalpy: 0.372634 hartree
zpe.thermalcorrgfe: 0.296605 hartree
zpe.sumelectzpe: -977.333099 hartree
zpe.sumelectthermal: -977.311560 hartree
zpe.sumelectthermalent: -977.310616 hartree
zpe.sumelectthermalfe: -977.386645 hartree
dipole: -2.1655 0.5467 -0.2305
dipole: 2.2453
quadrupole: -118.7167 -116.6804 -126.4586
quadrupole: -1.0995 6.7982 2.8780
quadrupole: 1.9019 3.9381 -5.8400 -1.0995 6.7982 2.8780
hfenergy: -977.6832495 hartree
pointgroup: C01 [X(C18H21N1O3)]
dipole: 0.8304809 0.1789179 -0.2421819 debye
polarizability: 198.9472519|1.427364|191.1712942|-16.0974255|-32.4480783|241.8894882 unknown
InChI: InChI=1S/C18H21NO3/c1-18(2,3)19-17(20)21-13-14-8-7-11-16(12-14)22-15-9-5-4-6-10-15/h4-12,19H,13H2,1-3H3
charge 0 multiplicity 1
43 atoms
O  2.359237 -0.306971 -2.349029
O  1.962532 -1.445323 -0.313334
O  -2.485488 1.081732 0.177354
N  3.855777 -0.078282 -0.658074
C  4.525912 -0.235206 0.670543
C  5.814327 0.619717 0.606441
C  3.592213 0.28339 1.795484
C  4.882745 -1.725967 0.907785
C  2.676036 -0.677005 -1.015109
C  1.044582 -0.817642 -2.852629
C  -0.082436 0.15415 -2.566232
C  -0.765573 0.096683 -1.325376
C  -0.452317 1.127279 -3.528745
C  -1.807833 1.014042 -1.065756
C  -2.174807 1.993343 -2.015849
C  -1.489342 2.045416 -3.248187
C  -2.759458 -0.086451 0.9351
C  -3.079922 -1.330322 0.34276
C  -2.797986 0.085235 2.336184
C  -3.428971 -2.415394 1.177113
C  -3.153137 -1.007553 3.156355
C  -3.466112 -2.262664 2.582802
H  5.577797 1.685721 0.42807
H  6.357508 0.548911 1.564018
H  6.490019 0.265773 -0.194923
H  2.654722 -0.296817 1.812942
H  3.345587 1.34882 1.637178
H  4.088962 0.180528 2.777283
H  5.55439 -2.09725 0.112658
H  5.394349 -1.841334 1.880535
H  3.968632 -2.342457 0.915145
H  4.287439 0.528052 -1.357711
H  0.861176 -1.800531 -2.384924
H  1.216359 -0.930233 -3.934824
H  -0.459766 -0.639406 -0.574478
H  0.07613 1.169002 -4.488185
H  -2.982491 2.690933 -1.775198
H  -1.771568 2.799244 -3.991074
H  -3.064989 -1.446944 -0.745201
H  -2.552331 1.064676 2.757355
H  -3.677976 -3.381004 0.723076
H  -3.181499 -0.878049 4.243906
H  -3.737028 -3.10944 3.222152
