program: Gaussian 09
title: 000181944
version: EM64L-G09RevD.01
frameworkgroup: C1[X(C18H22N2O2S)]
method: RPBEPBE
basis: SDD
operation: Freq
keyword: #p
keyword: freq=noraman
keyword: PBEPBE/SDD
title: #p freq=noraman PBEPBE/SDD
converged: NO YES NO NO
title: Mulliken charges:
elementType: S O O N N C C C C C C C C C C C C C C C C C C H H H H H H H H H H H H H H H H H H H H H H
charge: 0.034703 -0.305325 -0.257961 -0.110104 -0.084514 0.134293 0.506338 -0.695269 -0.746928 -0.698596 -0.395796 -0.374946 -0.382070 -0.383272 0.438943 -0.269006 0.204772 -0.609799 -0.272763 -0.148362 0.103172 -0.318795 -0.509852 0.207517 0.226232 0.217058 0.217574 0.217782 0.216381 0.208656 0.213947 0.223144 0.249099 0.229810 0.244756 0.249341 0.250008 0.253107 0.255249 0.266577 0.239628 0.256370 0.228498 0.237767 0.232634
chargesum: 0.00000
title: Mulliken charges with hydrogens summed into heavy atoms:
elementType: S O O N N C C C C C C C C C C C C C C C C C C
charge: 0.034703 -0.305325 -0.257961 -0.110104 -0.084514 0.134293 0.506338 -0.044461 -0.095191 -0.052848 -0.146697 -0.145136 -0.137313 -0.133931 0.438943 -0.269006 0.204772 0.148565 -0.006186 0.091266 0.103172 -0.062425 0.189046
polarizability: 3.43989086e+02 2.17157934e+01 2.20979754e+02 -1.68522056e+01 1.15579846e+01 1.76711613e+02
1716.lowfreq: -14.5518 -5.3112 -0.0017 -0.0015 -0.0005 3.1934 9.5361 14.1532 25.5717
frequency: -12.4660 14.1200 25.5547 29.2324 47.8814 53.8163 80.3801 111.1507 115.1072 128.0266 140.8177 151.7602 166.4524 185.8776 200.5237 227.2279 237.2656 241.5980 253.3339 290.8053 301.4574 305.4372 312.9174 341.4822 347.6141 367.5435 385.8691 409.2840 415.0273 446.6261 458.8393 461.3230 471.3906 526.7810 542.3235 581.4607 595.5705 613.8690 633.6490 636.9260 657.6551 679.0287 725.2925 735.3868 741.1544 793.4289 815.9081 829.5487 838.8756 840.7767 877.6120 916.7530 919.5419 928.8518 942.1224 948.4218 953.1982 966.5054 975.6597 992.4501 1005.9085 1018.8719 1024.8347 1055.6073 1082.3357 1106.1247 1112.7962 1113.2922 1114.1107 1121.7440 1137.3967 1154.4177 1163.9610 1176.1875 1199.5293 1205.3004 1216.5404 1249.0366 1270.9348 1282.0473 1299.2936 1346.3675 1358.4700 1366.1463 1373.3548 1376.6871 1395.1346 1402.8132 1403.9606 1414.3931 1435.4460 1449.2924 1451.3580 1459.1210 1460.7524 1464.5240 1465.8613 1466.7123 1477.6686 1483.5474 1485.8764 1492.5472 1499.1085 1568.1281 1582.7193 1594.4204 1611.6838 2972.7039 2973.6359 2978.8663 2994.8847 3009.1522 3068.1456 3068.9036 3070.2492 3077.4008 3078.6895 3081.8322 3093.5345 3095.6819 3134.7591 3138.0491 3148.6656 3150.4414 3153.2156 3165.4803 3172.1244 3191.4510 3220.0178
redmass: 3.9805 4.8465 4.9458 4.7562 4.2082 3.6547 4.1063 3.5865 1.2307 4.1693 2.7040 1.2939 3.0556 1.1859 2.8269 3.5946 3.1106 1.1609 3.9038 4.4415 4.9323 1.1354 2.8840 3.7152 2.8012 3.2571 4.3153 3.1261 3.2580 4.3970 4.6844 3.1237 3.9248 3.3486 3.3100 7.4495 6.6600 4.6916 7.1578 6.2418 5.5246 5.6093 2.2836 3.8401 4.4533 2.0540 4.0695 1.2512 3.4002 1.6848 1.4033 1.7555 5.1092 1.6316 1.2115 6.3829 1.3485 1.3721 1.3240 5.0842 2.9053 1.4570 1.3856 3.4763 2.1528 2.2672 1.3732 1.3019 2.0484 1.4525 1.9865 1.5129 1.8437 1.2529 1.6061 2.9858 2.7133 2.5407 3.1749 6.3675 1.2767 3.9577 6.1421 4.0990 1.3892 1.1865 2.3427 1.3896 2.4604 1.8556 1.2336 1.3007 1.1625 1.0510 1.2195 1.0551 1.0729 1.0736 1.0922 1.1158 1.0617 1.3943 1.4494 6.7396 6.2264 7.4848 6.4281 1.0348 1.0348 1.0358 1.0298 1.0341 1.1001 1.0998 1.1006 1.0984 1.0996 1.0991 1.1040 1.1022 1.0881 1.1041 1.1005 1.0880 1.0902 1.0959 1.0966 1.0961 1.0952
irintensity: 0.0432 0.1781 0.2473 0.4035 1.2228 0.6652 0.5246 5.8011 1.8634 4.9808 1.3621 2.5405 3.4608 0.6255 0.2549 1.2206 2.0122 0.2459 7.5583 2.9611 1.5933 0.0234 1.5819 7.9018 0.8014 1.1556 1.8162 1.2685 1.5118 1.4665 4.7231 1.4785 3.8498 7.1860 13.5692 1.1856 6.4742 3.7493 0.3341 7.9934 0.8392 0.4934 17.7246 8.0427 6.3128 64.7673 40.3536 0.1592 4.7621 38.0159 1.2985 3.8591 16.6356 2.3078 0.0161 0.1368 1.3644 0.0647 0.8008 63.2350 42.2911 9.3914 0.4664 76.5650 59.0579 69.2251 11.8550 13.3163 146.3488 42.7400 222.6013 42.3604 111.9385 14.2870 67.4030 6.0619 2.2057 141.7092 80.6914 151.6581 0.1107 497.4207 61.2259 0.4470 22.6297 19.1508 35.9236 14.0663 7.0861 413.0455 49.9535 85.7217 38.3442 0.0801 28.5885 0.9177 4.2203 19.8031 21.3059 124.5682 7.5234 9.7001 88.4433 156.7337 148.7281 1.9617 3.7319 31.0164 31.2406 33.1446 47.2938 24.8092 3.3600 4.9635 16.3256 134.7463 31.7179 46.8111 31.5727 15.3906 19.6339 30.2303 5.8840 10.0068 10.5631 10.6367 3.6159 3.9196 1.2022
temp: 298.150 k
press: 1.00000 atm
elementType: 16 8 8 7 7 6 6 6 6 6 6 6 6 6 6 6 6 6 6 6 6 6 6 1 1 1 1 1 1 1 1 1 1 1 1 1 1 1 1 1 1 1 1 1 1
symmnumber: 1
zpe: 950844.2 jmol-1
zpe.correction: 0.362157 hartree
zpe.thermalcorrener: 0.385117 hartree
zpe.thermalcorrenthalpy: 0.386061 hartree
zpe.thermalcorrgfe: 0.308096 hartree
zpe.sumelectzpe: -1355.413877 hartree
zpe.sumelectthermal: -1355.390918 hartree
zpe.sumelectthermalent: -1355.389974 hartree
zpe.sumelectthermalfe: -1355.467938 hartree
dipole: -0.1187 -1.9921 -0.1145
dipole: 1.9989
quadrupole: -121.6350 -149.4013 -136.0308
quadrupole: -8.8206 -2.1263 4.5511
quadrupole: 14.0540 -13.7123 -0.3418 -8.8206 -2.1263 4.5511
hfenergy: -1355.7760349 hartree
pointgroup: C01 [X(C18H22N2O2S1)]
dipole: -0.0266819 -0.7235985 -0.3068349 debye
polarizability: 325.7846779|44.3795615|216.3558168|-39.5126409|13.0877197|199.5399586 unknown
InChI: InChI=1S/C18H22N2O2S/c1-18(2,3)13-9-11-14(12-10-13)22-17(23)20(4)15-7-6-8-16(19-15)21-5/h6-12H,1-5H3
charge 0 multiplicity 1
45 atoms
S  -0.178211 2.535955 1.048285
O  -0.26724 -0.042639 0.109713
O  -5.67325 -2.32696 1.917002
N  -2.286123 0.790656 0.837884
N  -3.949756 -0.816086 1.332159
C  5.481701 -0.221345 -0.740539
C  3.949894 -0.138251 -0.535572
C  6.184283 0.739299 0.266347
C  5.908035 0.183485 -2.175105
C  5.962208 -1.681618 -0.482016
C  3.064029 0.308477 -1.549084
C  3.384225 -0.514866 0.715108
C  1.668932 0.382363 -1.331801
C  1.996909 -0.450907 0.949894
C  1.154688 0.002568 -0.082436
C  -0.938517 1.064396 0.651406
C  -2.946633 -0.44277 0.482382
C  -3.093837 1.832794 1.524472
C  -2.635939 -1.18469 -0.681392
C  -3.385334 -2.357359 -0.94156
C  -4.653198 -1.936359 1.059143
C  -4.412485 -2.760942 -0.070032
C  -5.914619 -1.476148 3.098961
H  7.282767 0.677356 0.15095
H  5.875303 1.785922 0.091028
H  5.937993 0.4861 1.312935
H  5.63225 1.229329 -2.404813
H  7.005899 0.099569 -2.271141
H  5.454621 -0.474347 -2.939567
H  7.057513 -1.752625 -0.620367
H  5.729963 -2.014176 0.545423
H  5.477598 -2.385776 -1.182822
H  3.45379 0.609195 -2.525352
H  4.034525 -0.865514 1.52409
H  0.992796 0.736682 -2.116023
H  1.567748 -0.742425 1.913298
H  -4.123418 1.462537 1.611644
H  -3.052402 2.769393 0.94414
H  -2.686663 2.032662 2.529615
H  -1.841201 -0.866245 -1.353497
H  -3.166028 -2.94821 -1.836714
H  -5.015727 -3.65588 -0.23467
H  -6.232684 -0.464065 2.793504
H  -5.002823 -1.393745 3.714815
H  -6.717883 -1.990992 3.645806
