program: Gaussian 09
title: 000177267
version: EM64L-G09RevD.01
frameworkgroup: C1[X(C18H35NO5)]
method: RPBEPBE
basis: SDD
operation: Freq
keyword: #p
keyword: freq=noraman
keyword: PBEPBE/SDD
title: #p freq=noraman PBEPBE/SDD
converged: YES YES NO NO
title: Mulliken charges:
elementType: O O O O O N C C C C C C C C C C C C C C C C C C H H H H H H H H H H H H H H H H H H H H H H H H H H H H H H H H H H H
charge: -0.458303 -0.437710 -0.500373 -0.208847 -0.437640 -0.386242 -0.137029 -0.159428 -0.187287 -0.160549 -0.408347 -0.391218 -0.333102 -0.390443 -0.386706 -0.386386 -0.386122 -0.372551 -0.374786 -0.527220 0.209850 -0.506870 -0.399751 -0.313441 0.244891 0.253941 0.253861 0.259224 0.258109 0.194512 0.205111 0.191897 0.198125 0.202401 0.211726 0.196879 0.196349 0.364729 0.345677 0.193267 0.194441 0.193934 0.194432 0.195553 0.196360 0.372758 0.189391 0.190060 0.226357 0.208039 0.235020 0.235453 0.224686 0.235861 0.227549 0.226070 0.212597 0.178191 0.333048
chargesum: 0.00000
title: Mulliken charges with hydrogens summed into heavy atoms:
elementType: O O O O O N C C C C C C C C C C C C C C C C C C
charge: -0.093574 -0.092033 -0.127615 -0.208847 -0.104592 -0.128133 0.107862 0.094514 0.066574 0.098675 -0.008724 -0.001196 0.081025 0.002786 0.001002 0.001980 0.005790 0.006900 0.059610 -0.056747 0.209850 -0.046323 0.053868 0.077348
polarizability: 2.84697156e+02 5.63738020e+00 1.97723842e+02 -1.91731320e+00 1.59575582e+00 1.76510127e+02
1716.lowfreq: -20.0907 -9.2425 -2.2362 -0.0022 0.0015 0.0020 1.9328 9.6854 16.7754
frequency: -7.5608 8.4170 15.5164 17.2160 32.0176 38.6230 46.6435 52.6394 65.8185 72.1559 74.9817 85.2163 105.6697 107.2429 113.0400 125.1371 132.3075 144.5730 149.9623 150.7288 164.0823 200.5839 212.9661 242.8448 247.1905 267.0604 288.7298 297.6718 311.1212 326.8271 343.5266 351.8920 366.5865 395.2921 428.9679 451.7987 459.0834 471.1736 484.2302 490.7381 505.6844 567.3656 618.4862 663.5450 679.3925 691.8678 710.1529 720.0633 727.6353 742.5062 763.2732 776.9559 793.5641 826.6592 841.0702 857.1062 862.0751 892.6367 906.5185 931.0510 949.7769 957.6265 964.7314 976.7180 977.9684 994.1378 999.9326 1005.0687 1013.9796 1030.2189 1034.9035 1042.4517 1048.3158 1060.6698 1066.4883 1075.8586 1078.2568 1080.3493 1085.4048 1095.6305 1104.6337 1109.8437 1120.2425 1131.0023 1149.5830 1159.6688 1185.1443 1195.9187 1198.9357 1211.9416 1217.0084 1225.1556 1230.5243 1235.5737 1240.1645 1256.1230 1262.7630 1268.1970 1270.8143 1277.3291 1279.6764 1283.3420 1285.5645 1287.9782 1295.9667 1296.2926 1300.9676 1317.0792 1325.3902 1331.3616 1338.8247 1344.2902 1349.1018 1352.2455 1355.3087 1357.4948 1361.0974 1369.1684 1384.8377 1386.1527 1402.9060 1427.3957 1435.4453 1446.3118 1448.6646 1459.5587 1459.7066 1463.1520 1465.6745 1467.5311 1467.9081 1473.7663 1481.4121 1483.3723 1486.7366 1631.6566 2938.1717 2938.9684 2945.1786 2945.6607 2946.5424 2948.1866 2949.7754 2950.4730 2951.0099 2956.3910 2961.6222 2964.9904 2979.9961 2982.2956 2986.0075 2989.0013 2992.8838 2993.9143 2994.6700 3004.5942 3007.0528 3014.0094 3019.0395 3031.5999 3041.2513 3048.9028 3055.9464 3072.8222 3074.9386 3097.7866 3298.7503 3493.7907 3496.3039 3557.9680 3594.7828
redmass: 4.8613 3.6201 5.4614 3.9928 4.2738 4.7162 1.6036 2.8767 4.6128 3.6597 3.8353 1.9383 3.3868 3.7340 3.1427 2.1553 2.3166 3.4002 2.0906 2.1501 3.2719 3.6032 4.3008 3.6275 3.6500 3.5782 1.4411 3.7191 4.4997 1.2629 2.7984 3.5171 2.9259 3.2709 3.3401 2.7494 1.9930 2.7090 2.5171 1.2922 3.1186 3.3585 2.7274 4.1057 1.5267 1.6477 1.1693 1.0678 1.1175 1.1734 1.2457 5.1748 1.3583 1.6158 3.4910 2.7040 1.5858 1.6887 2.3754 2.1404 1.6845 3.1124 4.0487 4.4161 3.6327 3.1702 1.9420 2.3711 3.3638 1.5184 2.5902 2.9653 2.9301 2.6425 2.0937 2.3355 2.2938 2.0996 2.1595 1.7864 1.6641 2.0793 2.4948 1.8393 1.5613 1.4166 1.1288 1.6138 1.2242 1.3962 1.3009 1.3916 1.3752 1.4011 1.3622 1.3086 1.3215 1.3240 1.2707 1.0859 1.1588 1.1920 1.1766 1.0918 1.1151 1.1318 1.3271 1.3524 1.4384 1.4139 1.3660 1.3204 1.5250 1.6507 1.5981 1.5977 1.7089 1.2586 1.2649 1.3558 1.4258 1.0878 1.0892 1.0864 1.1531 1.0689 1.0778 1.0611 1.0886 1.0839 1.0758 1.0971 1.1003 1.0900 1.1007 8.1101 1.0696 1.0829 1.0616 1.0568 1.0588 1.0592 1.0611 1.0595 1.0614 1.0596 1.0592 1.0586 1.0831 1.0960 1.0933 1.0743 1.0937 1.0718 1.0807 1.1026 1.1080 1.0924 1.1042 1.1046 1.1045 1.0954 1.1028 1.1004 1.0872 1.0891 1.0662 1.0657 1.0754 1.0661 1.0668
irintensity: 0.2811 2.5621 1.8686 1.1448 0.6003 1.7965 1.9898 3.0075 1.2321 5.2660 1.2673 1.7363 1.3365 0.3774 2.9750 0.9403 2.1778 4.2660 1.3904 0.5173 7.3507 0.8118 2.3299 29.9856 12.6803 3.9056 99.2880 6.2605 1.4808 141.6005 11.4540 6.1345 38.7004 0.8031 3.6818 2.6671 54.3484 11.0568 8.8247 103.5900 5.9374 3.3929 35.1085 4.8687 64.0975 119.7514 3.0469 15.0075 1.0956 18.1480 3.8130 31.4371 7.0042 3.6660 1.3904 4.8280 2.9670 5.2788 6.2393 3.0866 12.6453 10.8766 100.9374 25.4235 9.2314 44.6453 17.4843 6.5315 29.2484 4.1206 35.5582 5.6251 1.1242 8.6291 33.5040 10.5848 2.6669 0.2958 3.4721 1.9631 19.6251 7.0917 66.7523 4.1420 40.6299 9.6510 24.7543 0.1052 45.8631 37.2445 7.6131 16.7289 8.3821 2.0544 60.6010 9.0337 4.3984 3.4558 13.7057 0.3843 11.8196 11.6360 2.3512 5.0183 1.2467 1.0233 14.8255 3.2507 11.1564 2.2087 12.7813 15.2813 2.8136 0.6979 1.7068 6.3908 33.8136 24.5042 32.4159 9.6573 16.1927 17.8731 19.1952 6.7634 64.2664 0.0533 0.4156 0.1269 0.4986 7.9088 3.2890 3.9667 0.1018 10.0784 28.3835 84.8006 67.8331 23.9131 23.3976 53.9266 3.9152 8.0918 3.6647 2.6704 12.1038 0.2421 12.3722 201.8319 67.5183 0.3429 7.6652 21.5624 8.5216 9.9052 18.8127 0.5963 49.2378 14.4058 5.2420 0.5787 194.2611 7.8130 103.9811 57.8388 32.1384 25.0025 217.8112 4.8680 0.2865 7.6539 11.0368
temp: 298.150 k
press: 1.00000 atm
elementType: 8 8 8 8 8 7 6 6 6 6 6 6 6 6 6 6 6 6 6 6 6 6 6 6 1 1 1 1 1 1 1 1 1 1 1 1 1 1 1 1 1 1 1 1 1 1 1 1 1 1 1 1 1 1 1 1 1 1 1
symmnumber: 1
zpe: 1347805.9 jmol-1
zpe.correction: 0.513352 hartree
zpe.thermalcorrener: 0.541949 hartree
zpe.thermalcorrenthalpy: 0.542893 hartree
zpe.thermalcorrgfe: 0.448450 hartree
zpe.sumelectzpe: -1135.771602 hartree
zpe.sumelectthermal: -1135.743006 hartree
zpe.sumelectthermalent: -1135.742061 hartree
zpe.sumelectthermalfe: -1135.836505 hartree
dipole: 1.5238 3.6629 -1.9837
dipole: 4.4355
quadrupole: -185.6530 -145.1540 -153.2654
quadrupole: 56.3848 11.3539 -2.7102
quadrupole: -24.2955 16.2035 8.0921 56.3848 11.3539 -2.7102
hfenergy: -1136.2849542 hartree
pointgroup: C01 [X(C18H35N1O5)]
dipole: 0.5626287 -1.0807683 1.2492765 debye
polarizability: 284.3902494|-5.6489765|196.2718017|5.6513367|-5.9592218|178.2690745 unknown
InChI: InChI=1S/C18H35NO5/c20-12-8-10-14(22)9-6-4-2-1-3-5-7-11-15-17(23)18(24)16(13-21)19-15/h15-21,23-24H,1-13H2
charge 0 multiplicity 1
59 atoms
O  7.670387 1.430706 1.124259
O  7.122617 0.249219 -2.369259
O  7.979947 -1.15721 1.823846
O  -7.319714 -1.406764 0.223662
O  -12.382894 -0.362182 -0.626095
N  5.702697 -1.083022 -0.199536
C  5.541129 0.268994 0.428666
C  6.839019 1.037914 -0.008039
C  7.126671 -1.355575 -0.503985
C  7.567401 0.055991 -0.978455
C  4.232028 0.952007 -0.019585
C  2.957602 0.174176 0.375863
C  7.977236 -2.004889 0.610403
C  1.654272 0.89874 -0.029854
C  0.376927 0.107871 0.331644
C  -0.926844 0.828443 -0.079464
C  -2.202154 0.026026 0.262902
C  -3.50713 0.744039 -0.149012
C  -4.773794 -0.077499 0.17641
C  -6.071437 0.647587 -0.225541
C  -7.34734 -0.171206 -0.020886
C  -8.671182 0.600216 -0.116403
C  -9.887818 -0.288469 -0.44497
C  -11.219665 0.456883 -0.252574
H  5.55012 0.210417 1.539098
H  6.610666 1.975799 -0.538677
H  7.204616 -2.05207 -1.364541
H  8.654514 0.224564 -0.990307
H  5.173789 -1.845232 0.23675
H  4.25404 1.085647 -1.120813
H  4.199893 1.966289 0.429314
H  2.955381 0.004398 1.473898
H  2.97627 -0.826196 -0.103774
H  7.548658 -2.997618 0.862256
H  9.015174 -2.145359 0.240025
H  1.621413 1.894768 0.459033
H  1.669071 1.090047 -1.123295
H  7.910951 0.579939 1.602101
H  6.165594 -0.023573 -2.392701
H  0.413137 -0.888246 -0.157515
H  0.360692 -0.083519 1.425209
H  -0.903619 1.030905 -1.170901
H  -0.970503 1.819458 0.419133
H  -2.225688 -0.178665 1.353728
H  -2.157486 -0.963917 -0.237232
H  8.460881 -1.606727 2.56011
H  -3.476163 0.959105 -1.238213
H  -3.557929 1.729301 0.360808
H  -4.734573 -1.056064 -0.338309
H  -4.804606 -0.30765 1.259673
H  -6.035469 0.925469 -1.302555
H  -6.177635 1.611891 0.314681
H  -8.818623 1.093546 0.870941
H  -8.563623 1.426501 -0.846796
H  -9.822735 -0.649105 -1.488567
H  -9.853202 -1.186997 0.202113
H  -11.283538 1.334294 -0.919274
H  -11.308064 0.813265 0.798469
H  -12.368363 -1.197561 -0.093366
