program: Gaussian 09
title: 000178353
version: EM64L-G09RevD.01
frameworkgroup: C1[X(C22H17F6NO)]
method: RPBEPBE
basis: SDD
operation: Freq
keyword: #p
keyword: freq=noraman
keyword: PBEPBE/SDD
title: #p freq=noraman PBEPBE/SDD
converged: YES YES NO NO
title: Mulliken charges:
elementType: F F F F F F O N C C C C C C C C C C C C C C C C C C C C C C H H H H H H H H H H H H H H H H H
charge: -0.166660 -0.162483 -0.164743 -0.167938 -0.164225 -0.166033 -0.272067 -0.098669 0.046701 0.062791 0.413513 0.370419 0.370032 0.023742 -0.459409 -0.447089 -0.476447 0.288263 -0.356328 -0.362553 -0.376222 0.292797 -0.686899 -0.688068 -0.355975 -0.356184 -0.349173 -0.226883 0.240178 0.248339 0.198462 0.243072 0.253786 0.302072 0.230623 0.284981 0.229715 0.209523 0.237551 0.228927 0.219530 0.244868 0.234756 0.260401 0.264957 0.266691 0.237361
chargesum: 0.00000
title: Mulliken charges with hydrogens summed into heavy atoms:
elementType: F F F F F F O N C C C C C C C C C C C C C C C C C C C C C C
charge: -0.166660 -0.162483 -0.164743 -0.167938 -0.164225 -0.166033 -0.272067 -0.098669 0.046701 0.062791 0.413513 0.370419 0.370032 0.222204 -0.216338 -0.193303 -0.174375 0.288263 -0.125706 -0.077572 -0.146508 0.292797 -0.010899 0.011086 -0.095574 -0.091227 -0.082481 0.010478 0.240178 0.248339
polarizability: 3.73019558e+02 9.80739743e+00 3.27539523e+02 -1.49197789e+01 6.81553161e+00 1.33503711e+02
1716.lowfreq: -3.6501 -2.9300 -0.0004 -0.0002 0.0004 3.0531 4.9824 15.2872 17.0414
frequency: 3.0910 15.1791 17.0243 25.8617 31.4929 35.8430 56.0037 61.1457 71.3723 91.1713 110.2707 126.3462 133.7693 158.8090 178.0544 188.0889 205.1296 214.5686 226.3276 232.6561 247.3182 262.7240 277.3863 301.0295 320.9275 338.7470 353.6843 357.4843 369.9645 393.4647 403.4503 406.7692 427.3862 438.4248 447.4518 456.4304 471.5206 511.7897 522.1971 545.8288 557.0458 579.4762 606.7572 608.4970 617.0210 625.3820 633.1941 649.7394 667.0996 701.3118 706.7923 734.4016 737.5195 754.5768 779.7474 812.6682 843.8496 852.8266 852.9612 865.9291 884.6937 889.0190 926.7516 927.6866 940.3603 946.1829 956.9951 959.0675 969.7184 979.8689 987.2791 988.5462 991.7004 993.1404 1002.3183 1018.2203 1021.7469 1030.3981 1041.9031 1061.6883 1100.9189 1108.6362 1121.2983 1134.8769 1151.6703 1175.6758 1186.6008 1190.9764 1200.6908 1227.9779 1280.5260 1283.0004 1300.5620 1309.1865 1313.3904 1320.4167 1340.3298 1351.1386 1365.0932 1381.2914 1384.2072 1399.5465 1400.2830 1408.3038 1424.6504 1452.4249 1456.2461 1468.4289 1470.8650 1482.8736 1489.4067 1511.5297 1545.4063 1578.3845 1584.1747 1597.6976 1618.4316 1624.7880 2982.1542 2991.4761 2996.8865 3087.7703 3095.1835 3098.5469 3105.8952 3138.1987 3148.2779 3155.9897 3160.9220 3169.1343 3173.7687 3176.7554 3181.7995 3182.9045 3183.8839
redmass: 16.5224 14.5700 7.9150 5.2479 4.5561 7.5034 4.0412 4.1089 4.6819 4.4649 6.9535 7.4563 5.9264 8.2112 6.2796 1.0260 3.4661 6.0160 2.0360 5.3793 5.3063 2.2183 4.4327 6.1921 5.6610 7.7125 5.9495 8.2134 6.8820 3.5247 3.4477 4.3624 4.5183 3.6137 5.0402 6.4999 5.0576 9.8395 9.3678 4.8213 4.6175 5.5841 5.4411 12.0557 10.9742 3.9510 6.5798 7.4652 4.4801 1.9116 8.7454 6.4596 3.4781 3.4284 4.2406 1.5667 1.4365 4.1488 1.9522 1.4424 1.7252 2.7073 1.2634 1.4033 1.4559 1.6813 4.8311 5.0946 1.5345 6.3802 2.6423 6.8469 1.9572 6.9028 1.4536 6.0598 5.2618 3.3292 3.8982 2.1211 1.7328 1.7775 1.8345 1.5354 2.0821 1.8962 2.1868 1.1018 1.1388 1.8937 2.9194 3.8834 1.5119 1.4568 1.4353 3.2292 1.5986 3.5089 3.4400 5.6613 1.2547 4.2012 1.4542 3.8101 3.3336 3.7688 1.0622 1.0510 1.0539 2.7620 1.0518 2.8486 8.3613 5.6028 6.9964 6.1891 6.5960 6.2674 1.0842 1.0360 1.0365 1.0992 1.1003 1.0997 1.1006 1.0870 1.0879 1.0923 1.0893 1.0966 1.0962 1.0943 1.0937 1.0938 1.0909
irintensity: 0.0534 0.0857 0.2808 0.0507 0.1600 0.2666 0.5002 0.5020 0.3941 0.8853 1.6761 0.9226 0.1478 0.9723 1.4460 0.1028 0.4278 0.8409 0.9459 1.9556 1.8305 1.2983 0.3994 1.1233 1.2146 2.7309 2.8258 0.4547 9.2046 0.6998 4.7728 6.0204 1.8180 3.2327 6.9730 8.6965 5.0602 1.5976 0.2301 2.6993 9.3897 0.7358 3.2327 22.7407 1.2878 11.9443 1.2044 15.0172 3.2800 29.5124 5.1193 27.0961 4.8315 2.8196 1.7172 63.3908 40.1529 26.4313 14.9806 96.5323 2.4561 2.0715 7.2931 3.2292 14.3072 70.2731 12.5314 38.4072 27.2220 200.2651 13.0900 182.7641 3.4291 151.7700 17.1117 164.8448 134.9403 106.5503 151.4263 2.6945 123.9394 10.4848 5.5719 4.3717 12.8666 124.8719 181.2964 17.3915 0.2893 64.6386 91.2513 538.9007 27.9876 17.9456 74.1246 16.9112 57.5465 11.2846 60.7005 16.0469 28.6112 6.3857 40.5656 34.9769 22.1946 17.0864 6.1745 4.4303 12.4796 10.7198 12.1063 12.2040 187.9990 251.7166 104.2505 6.2861 11.7402 38.6731 26.1554 12.7694 21.3933 16.6669 27.0700 30.8433 31.6066 8.3357 5.6701 8.3986 0.6187 4.7945 3.4714 7.0046 1.6776 3.1764 8.9131
temp: 298.150 k
press: 1.00000 atm
elementType: 9 9 9 9 9 9 8 7 6 6 6 6 6 6 6 6 6 6 6 6 6 6 6 6 6 6 6 6 6 6 1 1 1 1 1 1 1 1 1 1 1 1 1 1 1 1 1
symmnumber: 1
zpe: 888297.3 jmol-1
zpe.correction: 0.338335 hartree
zpe.thermalcorrener: 0.365752 hartree
zpe.thermalcorrenthalpy: 0.366696 hartree
zpe.thermalcorrgfe: 0.274184 hartree
zpe.sumelectzpe: -1575.461118 hartree
zpe.sumelectthermal: -1575.433700 hartree
zpe.sumelectthermalent: -1575.432756 hartree
zpe.sumelectthermalfe: -1575.525269 hartree
dipole: 7.3924 8.1336 -0.6558
dipole: 11.0106
quadrupole: -176.6119 -167.2813 -177.1756
quadrupole: 11.5042 -4.6761 5.0576
quadrupole: -2.9223 6.4083 -3.4860 11.5042 -4.6761 5.0576
hfenergy: -1575.7994525 hartree
pointgroup: C01 [X(C22H17F6N1O1)]
dipole: 2.3444345 -3.5942354 0.591892 debye
polarizability: 367.4805454|-14.958318|331.3746221|24.3350347|-10.3768918|135.2076249 unknown
InChI: InChI=1S/C22H17F6NO/c1-13(2)30-18-11-19(14-6-8-16(9-7-14)21(23,24)25)29-20(12-18)15-4-3-5-17(10-15)22(26,27)28/h3-13H,1-2H3
charge 0 multiplicity 1
47 atoms
F  4.576253 4.275088 -1.029431
F  2.389875 3.849595 -1.47682
F  3.010645 4.563856 0.580086
F  -7.047304 1.036228 0.137145
F  -5.954427 3.012293 0.399065
F  -6.223157 2.124696 -1.667504
O  0.471433 -4.487104 0.346032
N  0.249831 -0.280705 0.197891
C  1.476026 -0.872617 0.302921
C  -0.869883 -1.075043 0.142258
C  0.486633 -3.099323 0.293517
C  2.649558 0.052291 0.35943
C  -2.178287 -0.362394 0.029315
C  1.759512 -5.252655 0.401356
C  1.643128 -2.282915 0.337121
C  -0.786213 -2.484114 0.202878
C  2.495665 1.388958 -0.087364
C  3.586173 2.280888 -0.052557
C  -3.383023 -1.043096 -0.296087
C  -2.230663 1.040025 0.251831
C  3.915854 -0.356739 0.855409
C  -4.635214 1.04827 -0.162089
C  1.372473 -6.626059 0.955671
C  2.387873 -5.319735 -1.000579
C  -4.601771 -0.34757 -0.392271
C  -3.445231 1.743134 0.157121
C  4.849526 1.866928 0.433696
C  5.003804 0.541379 0.888833
C  3.394633 3.704752 -0.492492
C  -5.930725 1.789383 -0.310975
H  2.435065 -4.737379 1.114812
H  2.644487 -2.71494 0.370948
H  -1.670174 -3.125064 0.195497
H  1.517137 1.70106 -0.461802
H  -3.378973 -2.119079 -0.49427
H  -1.299948 1.556885 0.498782
H  4.056509 -1.371798 1.24161
H  2.268456 -7.26626 1.044018
H  0.908333 -6.530039 1.951569
H  0.65228 -7.122064 0.282104
H  3.336849 -5.88511 -0.963109
H  2.601674 -4.317606 -1.410166
H  1.70376 -5.836734 -1.69586
H  -5.523396 -0.88335 -0.639533
H  -3.473464 2.821572 0.339487
H  5.691517 2.565437 0.449218
H  5.972286 0.210875 1.27749
