program: Gaussian 09
title: 000149891
version: EM64L-G09RevD.01
frameworkgroup: C1[X(C22H24N2O4)]
method: RPBEPBE
basis: SDD
operation: Freq
keyword: #p
keyword: freq=noraman
keyword: PBEPBE/SDD
title: #p freq=noraman PBEPBE/SDD
converged: YES YES NO NO
title: Mulliken charges:
elementType: O O O O N N C C C C C C C C C C C C C C C C C C C C C C H H H H H H H H H H H H H H H H H H H H H H H H
charge: -0.483377 -0.332303 -0.309220 -0.184579 -0.092677 -0.376916 -0.399667 -0.352298 -0.396641 -0.328120 -0.325642 0.019911 0.351287 0.123158 0.125665 0.297797 0.276380 -0.039666 0.158156 -0.667692 -0.697195 -0.273309 -0.437507 -0.356869 -0.370263 -0.376942 -0.227091 -0.222934 0.192629 0.261378 0.204902 0.198193 0.265107 0.210881 0.194596 0.203665 0.197056 0.197199 0.379264 0.223487 0.212269 0.204939 0.208500 0.284640 0.194932 0.293841 0.292123 0.293034 0.294450 0.243022 0.243111 0.405334
chargesum: 0.00000
title: Mulliken charges with hydrogens summed into heavy atoms:
elementType: O O O O N N C C C C C C C C C C C C C C C C C C C C C C
charge: -0.078043 -0.332303 -0.309220 -0.184579 -0.092677 0.002349 0.054340 0.050798 0.079347 0.070141 0.068613 0.019911 0.351287 0.123158 0.125665 0.297797 0.276380 -0.039666 0.158156 -0.026996 -0.009123 -0.273309 -0.143667 -0.064746 -0.077229 -0.082493 0.015932 0.020177
polarizability: 1.21080224e+03 -9.62228398e+00 2.86481655e+02 2.07712576e+01 4.16677427e+00 1.42742988e+02
1716.lowfreq: -7.0169 -4.6309 -0.0007 0.0007 0.0010 3.7033 6.5198 20.7262 29.7769
frequency: 4.0124 20.5831 29.7066 37.5822 50.3958 64.5272 75.0981 88.7953 94.9375 98.1015 108.9862 128.6219 147.5669 182.7096 185.1020 192.3846 219.6116 240.4492 249.5391 260.8248 272.9330 278.4710 291.4927 304.1943 331.4378 350.6812 378.5213 393.7421 404.0172 420.8873 424.7981 431.6818 448.5426 451.4485 462.2748 471.5758 484.7973 503.8088 544.5213 560.6982 579.0704 646.1767 651.7861 667.6479 680.5472 702.1745 711.1840 723.3150 756.1894 763.1607 785.8921 787.9038 792.1709 795.2057 803.0458 826.4512 848.3508 873.6658 889.1640 898.8920 902.1457 937.0594 939.8421 980.5940 993.5314 997.7752 1009.1972 1015.5973 1018.2776 1035.7438 1041.6004 1055.6783 1058.8113 1066.7630 1075.4061 1084.8814 1087.9303 1090.7170 1111.0137 1143.0439 1161.7086 1171.2270 1179.1573 1194.9190 1200.3350 1225.3233 1231.0747 1246.6721 1259.0296 1269.6000 1281.1783 1285.4019 1294.7898 1298.7089 1308.5287 1336.0939 1346.1365 1356.3252 1358.6500 1360.7189 1376.0253 1385.1699 1391.7270 1397.7432 1399.2537 1425.1771 1442.4180 1446.9829 1448.3868 1459.3168 1461.4286 1463.2663 1470.0860 1472.2784 1478.8702 1483.6471 1486.3871 1500.9030 1522.5696 1540.3239 1560.1786 1561.0868 1584.7388 1605.5036 1609.5247 1624.4928 2334.8792 2860.4784 2867.0983 2879.3596 2979.0868 2982.5299 2982.8234 3010.2298 3024.1384 3028.1532 3038.6692 3062.6380 3073.1301 3075.5667 3076.9914 3090.4841 3095.2448 3139.3122 3151.6224 3153.8852 3164.7832 3172.4083 3174.3798 3384.2586
redmass: 4.2379 4.0049 4.5863 4.9758 6.1390 3.6225 4.0616 3.8406 2.7920 3.5688 4.5395 3.8607 6.3918 6.0788 4.1136 1.5033 1.1609 3.0391 3.7630 6.1144 2.2727 4.6724 4.4387 2.0558 7.6624 2.2356 7.2394 6.7699 6.2756 3.3529 2.5029 5.0520 4.1158 3.2526 5.0727 2.9199 3.6129 3.6130 7.9762 5.3537 7.1813 6.5582 6.1680 5.9603 6.4369 2.9890 4.5240 2.8731 4.2122 5.1295 1.1765 1.2172 1.6068 2.0384 1.6660 2.5908 2.4931 5.0779 2.3816 2.1112 1.4591 2.0611 1.9953 4.0408 2.4582 1.3972 3.7606 1.3672 1.3808 2.2674 2.3568 1.0703 2.3851 2.4295 2.1008 1.9801 2.3214 2.4979 1.8907 1.7816 1.6953 1.1509 2.5675 2.1643 1.9201 1.4805 1.6861 2.7733 1.3991 1.8442 1.2325 3.2246 1.2371 1.1886 3.5659 1.3526 1.3502 2.7952 1.5603 1.3747 1.2986 1.2274 6.5912 5.9275 1.2488 5.9504 2.7953 1.1042 2.7034 1.0578 1.0889 1.0993 1.2223 2.0518 1.0711 1.0685 1.0713 1.0594 5.6509 2.0228 6.6462 3.6724 6.6775 4.4077 4.7588 3.5238 1.0827 1.0713 1.0711 1.0712 1.0364 1.0483 1.0478 1.0623 1.0868 1.0888 1.0977 1.0913 1.0986 1.1035 1.0985 1.1004 1.1005 1.0865 1.0892 1.0903 1.0949 1.0955 1.1000 1.0813
irintensity: 0.5026 0.1655 0.3230 0.7280 0.1568 4.8161 1.9477 6.5039 1.7111 9.8408 0.9872 1.9814 0.2329 0.2160 1.2559 19.1339 1.4802 6.1307 5.3036 0.0931 1.5340 2.6562 1.6251 0.3233 7.5782 47.9361 10.6778 3.9294 4.0615 2.0592 123.3107 0.9403 3.4926 3.7096 18.7791 1.4977 1.0820 1.5612 4.0384 3.7849 15.1090 2.2280 5.7526 0.8900 1.0373 32.9041 13.3051 41.1825 0.7589 4.5622 89.9028 57.7792 0.7046 33.0754 34.0924 63.6536 3.4129 18.4247 7.2462 20.5076 22.2359 17.9328 5.1476 1.2956 9.9247 4.5130 106.6204 0.4441 0.1993 12.3115 5.7679 128.3941 18.5697 81.2405 63.4582 19.9669 0.8524 9.5538 274.1785 55.0715 113.7425 0.2249 3.6085 8.6467 2.9670 20.4941 47.2278 29.3463 34.5223 33.7681 129.9550 200.4938 22.8682 5.7973 141.5092 6.4816 167.8825 463.3367 231.7442 115.4405 117.6942 26.5496 26.5092 88.7878 14.6434 125.1250 64.8058 36.9195 39.9266 3.2724 85.7317 42.1646 106.2563 49.2115 49.8835 6.1109 32.6994 13.5933 352.9632 202.4775 22.9312 9.6038 85.1534 8.2331 150.4377 211.1407 178.3358 133.8649 215.6336 659.3264 80.8376 149.6758 44.2125 32.7293 49.1771 64.8087 19.3291 4.8733 63.9515 12.6488 98.7655 60.8574 24.8805 3.6612 0.1862 10.4761 4.2655 2.9551 41.4570 49.3796
temp: 298.150 k
press: 1.00000 atm
elementType: 8 8 8 8 7 7 6 6 6 6 6 6 6 6 6 6 6 6 6 6 6 6 6 6 6 6 6 6 1 1 1 1 1 1 1 1 1 1 1 1 1 1 1 1 1 1 1 1 1 1 1 1
symmnumber: 1
zpe: 1096275.1 jmol-1
zpe.correction: 0.417549 hartree
zpe.thermalcorrener: 0.443532 hartree
zpe.thermalcorrenthalpy: 0.444476 hartree
zpe.thermalcorrgfe: 0.358085 hartree
zpe.sumelectzpe: -1261.146405 hartree
zpe.sumelectthermal: -1261.120422 hartree
zpe.sumelectthermalent: -1261.119478 hartree
zpe.sumelectthermalfe: -1261.205869 hartree
dipole: -1.2960 -3.4565 0.9888
dipole: 3.8216
quadrupole: -125.1543 -169.5088 -167.7633
quadrupole: 5.0333 4.0347 0.3765
quadrupole: 28.9878 -15.3666 -13.6212 5.0333 4.0347 0.3765
hfenergy: -1261.563954 hartree
pointgroup: C01 [X(C22H24N2O4)]
dipole: -0.4321576 -0.3546496 1.3957321 debye
polarizability: 1209.0746618|-18.5506981|184.7233026|-43.8416786|-64.9106989|246.2289197 unknown
InChI: InChI=1S/C22H24N2O4/c1-3-24(4-2)13-7-12-23-22(28)17-11-10-16-18(21(17)27)20(26)15-9-6-5-8-14(15)19(16)25/h5-6,8-11,23,27H,3-4,7,12-13H2,1-2H3
charge 0 multiplicity 1
52 atoms
O  -0.382803 -1.091169 1.199006
O  -2.70649 -1.258976 1.992372
O  2.394325 0.445052 -1.681943
O  -4.502758 1.899569 -2.173705
N  6.250622 0.261036 -0.314376
N  2.111402 -0.860495 0.234368
C  5.089619 0.818061 0.426239
C  4.354386 -0.260816 1.259249
C  3.527262 -1.243392 0.383008
C  7.453745 0.055444 0.532256
C  6.537552 0.953544 -1.601651
C  -2.192029 0.013152 0.019158
C  -2.641054 0.831569 -1.064927
C  0.15009 0.197011 -0.803855
C  -0.793754 -0.302462 0.147327
C  -4.569016 -0.193983 0.88242
C  -5.034476 0.62182 -0.193594
C  -3.133233 -0.513136 1.007655
C  1.643334 -0.062437 -0.781455
C  8.347664 -1.097687 0.035229
C  5.627091 0.486873 -2.753735
C  -4.088588 1.170992 -1.214626
C  -1.704571 1.320424 -1.998198
C  -0.336583 1.003037 -1.85972
C  -5.488518 -0.700967 1.835539
C  -6.415303 0.916586 -0.297161
C  -6.859887 -0.400863 1.721961
C  -7.323997 0.409349 0.653607
H  5.409381 1.65086 1.101215
H  4.381634 1.241264 -0.306926
H  3.683512 0.227851 1.992867
H  5.096923 -0.837557 1.844651
H  3.99314 -1.305396 -0.616299
H  3.5409 -2.253893 0.830626
H  8.057269 0.994899 0.607202
H  7.115336 -0.176443 1.559338
H  6.452672 2.061285 -1.477669
H  7.591382 0.750065 -1.86816
H  1.415738 -1.200279 0.914793
H  7.780502 -2.044847 0.029739
H  8.712588 -0.91692 -0.991932
H  9.230796 -1.214554 0.691131
H  5.793309 -0.586746 -2.95558
H  4.558535 0.62456 -2.516039
H  5.855947 1.055689 -3.675364
H  -2.064548 1.943637 -2.821546
H  0.410848 1.370084 -2.571159
H  -5.104353 -1.323067 2.649468
H  -6.747375 1.543519 -1.130691
H  -7.568807 -0.792902 2.458622
H  -8.390906 0.640866 0.567959
H  -1.258056 -1.335311 1.760405
