program: Gaussian 09
title: 000012573
version: EM64L-G09RevD.01
frameworkgroup: C1[X(C6H5Cl2P)]
method: RPBEPBE
basis: SDD
operation: Freq
keyword: #p
keyword: freq=noraman
keyword: PBEPBE/SDD
title: #p freq=noraman PBEPBE/SDD
converged: YES YES NO NO
title: Mulliken charges:
elementType: Cl Cl P C C C C C C H H H H H
charge: -0.201874 -0.201979 0.447794 -0.242720 -0.155309 -0.259647 -0.209349 -0.203754 -0.213882 0.273038 0.248064 0.240281 0.239944 0.239394
chargesum: 0.00000
title: Mulliken charges with hydrogens summed into heavy atoms:
elementType: Cl Cl P C C C C C C
charge: -0.201874 -0.201979 0.447794 -0.242720 0.117729 -0.011584 0.030932 0.036190 0.025512
polarizability: 1.43774613e+02 -1.02222122e-01 8.25758733e+01 4.67548320e+00 -3.75416234e-01 9.51262093e+01
1716.lowfreq: -5.0603 0.0017 0.0026 0.0032 12.1609 15.0998 26.0096 78.9050 114.3969
frequency: 25.1958 78.8855 114.3788 140.2916 211.8631 258.1250 387.8723 394.6192 395.2928 429.4946 481.9610 608.5108 682.2083 692.0135 755.8729 846.6980 925.5130 976.7069 983.6766 1005.0668 1017.6920 1075.6454 1083.9838 1177.6958 1194.2060 1309.2286 1379.8787 1422.8389 1462.5660 1579.9495 1590.7142 3122.5992 3136.6969 3148.0690 3159.9559 3172.1895
redmass: 4.7398 9.9855 10.5292 14.1854 5.6212 7.8223 3.8766 6.0805 13.6148 18.8224 3.8293 6.4853 6.8172 1.9066 1.6483 1.2533 1.3549 1.3978 6.3418 1.3379 3.2931 2.2666 1.8192 1.0551 1.1223 1.3360 7.5453 2.1268 1.9940 5.7101 5.8300 1.0883 1.0868 1.0912 1.0964 1.1017
irintensity: 0.3160 0.1629 6.3219 1.1177 0.0090 1.3783 21.0500 33.0357 59.2597 19.5429 37.3113 0.4717 8.0351 48.2104 50.5555 0.2233 0.1708 0.1191 3.0619 0.0893 0.1383 36.7138 20.2585 0.0375 3.0761 4.2412 1.1188 21.3264 1.6332 0.6591 7.6579 1.3374 0.3793 8.8795 15.2030 21.7945
temp: 298.150 k
press: 1.00000 atm
elementType: 17 17 15 6 6 6 6 6 6 1 1 1 1 1
symmnumber: 1
zpe: 241814.1 jmol-1
zpe.correction: 0.092102 hartree
zpe.thermalcorrener: 0.101329 hartree
zpe.thermalcorrenthalpy: 0.102274 hartree
zpe.thermalcorrgfe: 0.055281 hartree
zpe.sumelectzpe: -1492.370800 hartree
zpe.sumelectthermal: -1492.361573 hartree
zpe.sumelectthermalent: -1492.360629 hartree
zpe.sumelectthermalfe: -1492.407621 hartree
dipole: 4.4193 -0.0045 0.9604
dipole: 4.5225
quadrupole: -69.4992 -81.7673 -66.2174
quadrupole: -0.0012 -1.3367 -0.2354
quadrupole: 2.9954 -9.2727 6.2772 -0.0012 -1.3367 -0.2354
hfenergy: -1492.4629022 hartree
pointgroup: C01 [X(C6H5Cl2P1)]
dipole: -1.7347873 -0.377602 0.1172671 debye
dipolederiv: -0.4633083 0.0522027 0.1588139 -0.1209375 -0.2065177 0.1903371 0.3171473 -0.0304963 -0.7231463 -0.4590328 -0.0540257 -0.1551932 -0.2874164 -0.4828491 -0.3854301 -0.1760849 -0.1613912 -0.4535932 1.453453 -0.0946636 0.0342498 0.0193438 0.6879048 0.1839303 -0.0046653 0.1833133 1.1544649 -0.5401989 0.0794896 -0.0305439 0.1875057 -0.1876052 0.0099335 -0.0637329 0.0083716 -0.166007 -0.0032308 0.1423386 -0.0496545 -0.1580732 -0.0119896 -0.0087607 0.0552164 -0.0076921 -0.0311077 0.0417202 -0.1505048 0.053846 0.2738662 0.0415815 -0.0585808 -0.0957958 -0.0608812 -0.1096022 -0.2154436 -0.1290188 0.0445555 -0.062296 0.1010912 -0.084716 0.0215074 -0.0846699 -0.1079776 -0.0286914 0.1785277 -0.0624482 0.1405058 -0.0434864 -0.0279482 -0.0493451 -0.0280448 -0.1155029 0.1638548 -0.0383814 0.0145285 -0.0089345 0.0174834 -0.0501637 0.0041892 -0.050439 -0.1076631 0.0424048 -0.0629285 0.0217414 -0.043934 0.0574822 0.0247352 0.0151255 0.0250717 0.1197014 0.1018216 0.0745362 -0.026373 0.0380796 -0.0201617 0.0560472 -0.0134399 0.0563521 0.1190816 0.043619 0.044787 -0.0163011 0.0654019 -0.0553085 0.0742198 -0.0234207 0.0740556 0.1281269 -0.0368634 -0.0855647 0.0291289 -0.091785 0.0110178 0.0539623 0.0314579 0.0540163 0.1467375 -0.1001041 0.0432056 -0.0163499 0.0486735 0.0913573 0.0224341 -0.0181591 0.022434 0.1464876 unknown
polarizability: 143.6747847|4.9801759|93.752409|-1.3952105|-4.0717727|84.0495016 unknown
InChI: InChI=1S/C6H5P.2Cl/c7-6-4-2-1-3-5-6;;/h1-5H;;
charge 0 multiplicity 1
14 atoms
Cl 2.734951 -0.248697 -1.725026
Cl 2.70754 0.880887 1.547155
P  1.915732 -0.867361 0.312941
C  0.151694 -0.296136 0.102372
C  -0.219257 0.993424 -0.353424
C  -0.843026 -1.253356 0.434817
C  -1.584575 1.321856 -0.475308
C  -2.21047 -0.916113 0.310094
C  -2.580313 0.369426 -0.144143
H  0.552282 1.727107 -0.608308
H  -0.560699 -2.253118 0.787768
H  -1.874662 2.317531 -0.827243
H  -2.977709 -1.654074 0.566577
H  -3.639889 0.630524 -0.240472
