program: Gaussian 09
title: 000146121
version: EM64L-G09RevD.01
frameworkgroup: C1[X(C13H8F3N2O2)]
method: RPBEPBE
basis: SDD
operation: Freq
keyword: #p
keyword: freq=noraman
keyword: PBEPBE/SDD
title: #p freq=noraman PBEPBE/SDD
converged: NO YES NO NO
title: Mulliken charges:
elementType: F F F O O N N C C C C C C C C C C C C C H H H H H H H H
charge: -0.101166 -0.166398 -0.104540 -0.237926 -0.354901 0.058423 0.142727 0.396034 0.379913 -0.560871 0.367512 -0.374981 -0.380749 -0.306761 -0.379880 -0.218978 -0.212823 0.379061 0.001107 0.350238 0.278083 0.266167 0.297386 0.257691 0.263459 0.258972 0.258823 0.444376
chargesum: 1.00000
title: Mulliken charges with hydrogens summed into heavy atoms:
elementType: F F F O O N N C C C C C C C C C C C C C
charge: -0.101166 -0.166398 -0.104540 -0.237926 0.089475 0.058423 0.142727 0.396034 0.379913 -0.282788 0.367512 -0.108814 -0.123058 -0.009374 -0.116422 0.039995 0.045999 0.379061 0.001107 0.350238
polarizability: 4.34470131e+02 1.50572274e+01 1.87457433e+02 -4.92307703e+00 5.54238724e-01 6.72321419e+01
1716.lowfreq: -1.3734 -0.0009 -0.0007 -0.0007 2.9313 9.0666 18.9937 28.9447 43.6143
frequency: 18.4805 28.9127 43.5257 64.0064 81.4926 130.1196 138.4122 165.3346 180.5459 184.6134 209.1045 282.6805 311.6586 315.7440 356.6517 392.0382 400.5440 429.2213 451.9924 465.3970 472.4375 505.0169 508.4246 517.9526 524.1651 531.7848 608.8966 613.4976 628.3185 631.4389 645.3799 686.7660 729.0212 759.1269 761.3540 772.5338 820.2924 854.0174 881.3806 915.0934 928.6909 950.0352 971.8384 987.3153 993.9515 1011.8057 1024.6257 1057.4926 1074.8799 1134.4426 1157.8918 1166.0922 1185.3220 1187.7176 1231.3133 1248.7073 1279.0545 1286.9409 1358.3532 1415.4592 1423.8231 1434.1422 1444.9152 1456.9045 1494.3408 1509.8064 1568.3063 1595.1497 1628.3258 2083.0190 3141.3910 3145.9960 3153.1315 3162.3395 3162.8674 3179.2703 3225.9325 3409.0418
redmass: 6.3532 11.5255 8.4387 9.2379 7.5695 11.3732 8.2312 8.6066 4.2670 7.2234 10.3461 8.1969 6.8322 8.4938 13.6492 4.8817 3.1863 11.7742 9.3605 12.0258 2.5517 7.3126 4.1438 7.8481 9.4038 8.7910 1.3831 6.5412 2.9303 10.0263 6.4655 8.6731 8.5164 5.1617 1.5719 1.6929 1.4419 5.9303 1.4091 1.6711 5.4513 9.9340 1.3461 1.4063 7.5087 1.3794 2.3447 7.1102 2.6718 1.7350 3.0245 1.2703 1.0827 2.3806 2.0006 1.4831 1.8092 9.6841 1.8130 6.3527 5.3982 2.7426 2.7352 4.4377 4.8946 3.6460 6.7914 5.8703 6.7695 13.9374 1.0885 1.0902 1.0920 1.0936 1.0946 1.1004 1.0942 1.0665
irintensity: 0.2205 0.5975 0.3316 1.4887 3.4087 0.6427 0.1388 1.2350 1.0807 2.6350 1.8119 2.2556 3.1344 5.0467 4.2972 6.4785 0.0496 7.5943 9.3159 3.8901 24.3108 0.5301 0.3774 6.2867 16.5330 39.1974 113.5060 1.3467 24.7039 31.9560 7.1141 5.0791 15.1480 6.9855 6.6270 35.1527 52.9749 22.5996 46.8253 17.5633 2.9319 193.5904 1.4696 6.4146 244.3579 0.0589 2.9157 199.6883 52.9656 6.0850 163.6775 19.3467 0.4523 284.1004 15.4906 0.0140 10.0725 237.1827 21.3201 36.8349 40.0411 50.9633 34.5523 150.1482 113.1038 7.7292 33.7376 15.7981 231.6746 638.9527 1.5266 0.2568 1.7577 3.5224 4.9950 17.9297 4.7322 648.6424
temp: 298.150 k
press: 1.00000 atm
elementType: 9 9 9 8 8 7 7 6 6 6 6 6 6 6 6 6 6 6 6 6 1 1 1 1 1 1 1 1
symmnumber: 1
zpe: 489799.1 jmol-1
zpe.correction: 0.186555 hartree
zpe.thermalcorrener: 0.203618 hartree
zpe.thermalcorrenthalpy: 0.204562 hartree
zpe.thermalcorrgfe: 0.139554 hartree
zpe.sumelectzpe: -1057.931421 hartree
zpe.sumelectthermal: -1057.914358 hartree
zpe.sumelectthermalent: -1057.913414 hartree
zpe.sumelectthermalfe: -1057.978421 hartree
dipole: -0.6781 0.2526 -0.6268
dipole: 0.9573
quadrupole: -47.4572 -87.6916 -114.5667
quadrupole: 1.0713 -1.9876 1.4318
quadrupole: 35.7813 -4.4531 -31.3282 1.0713 -1.9876 1.4318
hfenergy: -1058.1179754 hartree
pointgroup: C01 [X(C13H8F3N2O2)]
dipole: -0.2617957 0.2577017 0.0831249 debye
polarizability: 435.2495778|3.3260729|68.2137541|6.4033619|11.060889|185.6963733 unknown
InChI: InChI=1S/C13H8F3N2O2/c14-13(15,16)11(18-17)12(19)20-10-6-5-8-3-1-2-4-9(8)7-10/h1-7,19H
charge 1 multiplicity 1
28 atoms
F  5.419678 0.414432 0.42773
F  4.42925 0.312437 -1.639754
F  4.758933 -1.574584 -0.430356
O  0.708376 -0.073935 0.25746
O  1.781415 -0.171426 -1.785406
N  2.999109 0.212785 1.632273
N  2.952801 0.402731 2.783304
C  -2.959273 -0.033088 0.698724
C  -3.441857 -0.104399 -0.669936
C  -1.55227 -0.027479 0.933646
C  -0.683889 -0.087843 -0.158366
C  -2.491052 -0.168363 -1.743706
C  -3.903692 0.028633 1.778157
C  -1.114689 -0.162128 -1.516219
C  -4.85117 -0.111981 -0.907141
C  -5.274534 0.01991 1.512423
C  -5.750501 -0.05083 0.164264
C  1.826248 -0.080473 -0.442989
C  3.054149 0.003598 0.305301
C  4.419529 -0.21856 -0.300329
H  -1.157889 0.023021 1.953386
H  -2.858792 -0.226257 -2.773751
H  -0.409761 -0.217074 -2.344269
H  -3.539243 0.082315 2.809962
H  -5.221812 -0.166468 -1.936412
H  -5.993933 0.067087 2.335621
H  -6.828459 -0.056938 -0.025318
H  2.662227 -0.046222 -2.244697
