program: Gaussian 09
title: 000146101
version: EM64L-G09RevD.01
frameworkgroup: C1[X(C15H10O5)]
method: RPBEPBE
basis: SDD
operation: Freq
keyword: #pfreq=noraman
keyword: PBEPBE/SDD
title: #p freq=noraman PBEPBE/SDD
converged: NO YES NO NO
title: Mulliken charges:
elementType: O O O O O C C C C C C C C C C C C C C C H H H H H H H H H H
charge: -0.326227 -0.424647 -0.332235 -0.187562 -0.401798 0.075155 0.376868 0.294590 0.269232 -0.027852 -0.276102 0.123654 -0.590913 0.040827 0.185197 -0.372342 -0.378472 -0.226367 -0.223891 -0.502424 0.314212 0.292644 0.293665 0.241393 0.241652 0.394605 0.387267 0.232289 0.283974 0.223609
chargesum: 0.00000
title: Mulliken charges with hydrogens summed into heavy atoms:
elementType: O O O O O C C C C C C C C C C C C C C C
charge: -0.326227 -0.030043 -0.332235 -0.187562 -0.014531 0.075155 0.376868 0.294590 0.269232 -0.027852 -0.276102 0.123654 -0.276701 0.040827 0.185197 -0.079698 -0.084807 0.015026 0.017761 0.237449
polarizability: 3.36156493e+02 3.67036041e+00 2.10459971e+02 -1.18140007e+00 1.37514889e+00 7.25295505e+01
1716.lowfreq: -9.3900 -0.0009 -0.0006 -0.0006 5.4283 8.1767 45.9398 55.4544 89.6989
frequency: 45.9367 55.4347 89.6959 109.9058 140.3648 149.7348 158.2561 172.1451 216.0823 229.0175 274.7363 287.9874 298.4888 331.6145 342.6364 373.9734 400.2492 415.6796 429.3104 451.6645 466.9890 505.9535 527.9156 565.0744 589.1203 595.9009 603.2359 626.9012 673.9526 681.0902 715.8192 721.5565 739.1342 765.0988 802.9740 843.2336 852.4505 912.2338 939.0947 942.8324 994.0250 997.9727 1007.1621 1015.6909 1031.6404 1049.2343 1076.7768 1109.9698 1118.5047 1150.0568 1165.4871 1173.0293 1191.3784 1209.1891 1260.0272 1272.8367 1286.2740 1364.8474 1372.0280 1395.7720 1422.8122 1424.2986 1440.7969 1448.5152 1454.6365 1457.3308 1478.2251 1479.1554 1534.8544 1565.7192 1568.6724 1589.7439 1606.9291 1629.1284 2478.7902 2996.3557 3111.4664 3138.2323 3151.9202 3153.3513 3164.5783 3173.7594 3182.2655 3458.5059
redmass: 5.3930 3.5254 2.8865 3.0671 4.1795 6.6531 2.2307 5.7740 6.4266 4.0000 7.3582 5.7611 5.7899 6.8644 8.4386 7.4842 5.5204 8.8932 3.8604 4.9974 10.5118 8.3358 7.4896 4.7654 1.5330 3.3033 4.5101 6.9108 5.5634 5.4150 7.6743 2.7645 6.0659 6.9224 1.6995 2.7267 7.1708 1.4453 1.8705 8.4922 5.0384 1.3968 1.0625 1.3681 2.8408 3.4465 3.8970 2.4473 1.3250 1.3562 1.4561 1.1499 2.3863 2.3517 1.8534 2.6270 2.7694 3.8466 4.4270 8.3162 6.4815 1.9746 2.2232 2.4265 1.4922 1.7847 1.2320 2.2671 8.9480 4.0592 5.6429 6.1103 5.6509 4.3332 1.0777 1.0334 1.0990 1.0864 1.1064 1.0904 1.0948 1.1000 1.0926 1.0637
irintensity: 6.3806 2.7171 2.8192 0.3867 1.4020 2.2239 1.3241 2.3574 0.1126 2.7790 1.3488 0.3624 5.6186 10.2980 6.9780 2.0656 5.6143 24.9826 6.7611 1.0723 1.0538 3.9603 2.8174 5.7443 94.4363 41.6914 11.9358 44.5219 15.4223 3.5333 3.0643 48.0271 6.6150 25.5021 39.4337 0.5961 6.6287 15.9448 4.7288 67.3989 3.4851 2.0838 138.2032 0.2165 26.3536 4.1656 15.9209 93.0766 14.6383 64.1721 81.6924 16.8550 105.1813 24.5639 30.4100 219.2008 125.8162 509.3034 653.2698 9.2385 25.3885 2.9860 206.1109 23.5495 13.5945 28.1144 14.1924 20.5510 265.0294 20.2321 70.1929 1.9537 9.6972 94.2142 259.3070 79.5031 31.9699 4.0059 6.9513 7.0972 2.6887 27.7420 3.0110 126.8849
temp: 298.150 k
press: 1.00000 atm
elementType: 8 8 8 8 8 6 6 6 6 6 6 6 6 6 6 6 6 6 6 6 1 1 1 1 1 1 1 1 1 1
symmnumber: 1
zpe: 564610.0 jmol-1
zpe.correction: 0.215049 hartree
zpe.thermalcorrener: 0.231142 hartree
zpe.thermalcorrenthalpy: 0.232086 hartree
zpe.thermalcorrgfe: 0.171767 hartree
zpe.sumelectzpe: -952.346449 hartree
zpe.sumelectthermal: -952.330356 hartree
zpe.sumelectthermalent: -952.329411 hartree
zpe.sumelectthermalfe: -952.389731 hartree
dipole: 0.2206 -2.4587 1.0018
dipole: 2.6641
quadrupole: -79.8101 -127.1245 -116.4252
quadrupole: -1.0953 4.0923 -1.6373
quadrupole: 27.9765 -19.3379 -8.6386 -1.0953 4.0923 -1.6373
hfenergy: -952.5614977 hartree
pointgroup: C01 [X(C15H10O5)]
dipole: 0.0696583 0.9259847 -0.4861298 debye
polarizability: 336.1587409|-2.8050761|209.4191392|-3.7924076|-11.6788797|73.5681344 unknown
InChI: InChI=1S/C15H10O5/c1-20-15-10(16)6-9-11(14(15)19)13(18)8-5-3-2-4-7(8)12(9)17/h2-6,16,19H,1H3
charge 0 multiplicity 1
30 atoms
O  4.248932 0.297663 -0.000013
O  1.990253 2.202873 -0.141501
O  -0.480765 2.514554 -0.181245
O  -1.327595 -2.939029 0.179327
O  3.748844 -2.296934 0.171888
C  0.448471 0.304915 -0.04955
C  0.249835 -1.111858 0.055963
C  -2.05684 0.683695 -0.076669
C  -2.275791 -0.7232 0.017524
C  -0.678722 1.225987 -0.107849
C  -1.128375 -1.684702 0.091014
C  1.783914 0.846145 -0.077363
C  1.353691 -1.977315 0.13091
C  2.89009 -0.043018 -0.027254
C  2.660235 -1.442949 0.092785
C  -3.161113 1.568837 -0.139855
C  -3.599744 -1.222575 0.046101
C  -4.475699 1.060947 -0.111232
C  -4.695309 -0.336963 -0.018259
C  4.733719 1.464844 -0.778581
H  1.199764 -3.05606 0.212037
H  -2.962664 2.642522 -0.210268
H  -3.740449 -2.305524 0.120009
H  -5.328281 1.746439 -0.16073
H  -5.717689 -0.728892 0.003986
H  1.029636 2.642413 -0.169797
H  4.578583 -1.743551 0.137966
H  5.817205 1.491022 -0.591253
H  4.241729 2.38446 -0.431823
H  4.531632 1.309554 -1.854166
