program: Gaussian 09
title: 000149775
version: EM64L-G09RevD.01
frameworkgroup: C1[X(C22H21N3O4S)]
method: RPBEPBE
basis: SDD
operation: Freq
keyword: #p
keyword: freq=noraman
keyword: PBEPBE/SDD
title: #p freq=noraman PBEPBE/SDD
converged: YES YES NO NO
title: Mulliken charges:
elementType: S O O O O N N N C C C C C C C C C C C C C C C C C C C C C C H H H H H H H H H H H H H H H H H H H H H
charge: 0.923919 -0.320156 -0.256923 -0.554618 -0.567513 -0.476641 -0.034456 -0.465428 0.214908 0.237004 0.239725 -0.061291 -0.100767 0.275178 -0.335722 -0.388030 -0.478447 0.164703 -0.309195 -0.278604 0.268996 0.335246 -0.381192 -0.382951 -0.358711 -0.257893 -0.232242 -0.761886 -0.532879 -0.537057 0.350107 0.271203 0.236400 0.289290 0.267143 0.274952 0.250612 0.279094 0.233118 0.229836 0.233474 0.253384 0.263235 0.282995 0.273896 0.257152 0.225348 0.242172 0.250208 0.225033 0.224268
chargesum: 0.00000
title: Mulliken charges with hydrogens summed into heavy atoms:
elementType: S O O O O N N N C C C C C C C C C C C C C C C C C C C C C C
charge: 0.923919 -0.320156 -0.256923 -0.554618 -0.567513 -0.126534 -0.034456 -0.212044 0.214908 0.237004 0.239725 -0.061291 -0.100767 0.275178 -0.064519 -0.151629 -0.189157 0.164703 -0.042052 -0.003652 0.268996 0.335246 -0.130580 -0.103856 -0.125593 -0.028057 0.001233 0.058241 0.191793 0.162452
polarizability: 6.81510644e+02 8.04159419e+01 4.30060241e+02 1.50215214e+01 1.80858021e+00 1.91543753e+02
1716.lowfreq: -5.6150 -2.8154 -0.0005 0.0008 0.0015 2.7599 13.0914 16.4937 32.7188
frequency: 13.0179 16.4585 32.6848 36.1941 42.5020 45.3983 54.1373 89.2483 92.8749 110.3730 114.6402 120.2528 128.4188 131.1422 154.5762 162.3615 174.7918 186.6497 206.3224 224.0902 230.6084 239.5919 250.8939 272.4519 285.1773 294.6165 302.7410 309.3023 321.4524 334.9268 364.5494 384.6883 401.9175 408.8933 427.0776 450.9301 458.8918 471.9750 499.3312 522.5574 530.1899 539.3040 540.0857 570.3560 583.6546 587.8362 609.7358 629.7527 633.8927 650.0226 657.7272 707.2939 716.5177 718.3534 732.0113 739.7196 768.5862 779.8729 783.6557 796.0179 800.2940 819.3750 841.4031 852.9903 859.1829 874.1599 882.7441 885.9800 907.3760 927.2750 936.6310 938.0532 956.1128 961.4519 964.5289 994.3319 995.1646 996.0360 999.3412 1018.5997 1074.1647 1109.1375 1118.2151 1121.6860 1124.9100 1146.0337 1155.4878 1157.0041 1167.3450 1174.2959 1184.6055 1192.2316 1228.9584 1233.5647 1254.5083 1275.1551 1287.7825 1295.1287 1300.0182 1329.5215 1342.4443 1371.3516 1386.7206 1392.9880 1414.3093 1419.4974 1421.8555 1433.0438 1439.7234 1448.1508 1455.8157 1460.8867 1468.7260 1470.2187 1472.3120 1472.7355 1480.1856 1489.0737 1516.2178 1516.4911 1542.7766 1552.4331 1567.5272 1607.9558 1613.6821 1637.8180 2965.7821 2975.2995 3034.2529 3056.9014 3071.5396 3126.3109 3129.2123 3133.2815 3134.4217 3139.0812 3153.1035 3156.8221 3172.0711 3172.4258 3174.4439 3178.8554 3183.9058 3192.4547 3197.2128 3301.7456 3478.0590
redmass: 6.9649 6.8658 5.5778 4.4287 6.5972 5.3335 3.9573 4.5755 4.0214 4.0034 5.4138 4.1156 4.1906 5.0635 4.5254 1.1835 3.9996 3.6778 3.5938 1.9128 1.3749 3.8143 3.2185 2.8473 3.0156 4.1613 7.3669 5.8295 5.5742 5.8468 7.7499 4.5476 4.4533 4.0044 5.1385 3.9101 3.9315 2.8433 5.1228 6.8791 4.2762 3.6224 4.8915 7.1703 6.9020 3.3237 2.4734 3.0299 3.6811 3.4089 6.1788 5.4047 4.1161 4.1708 6.4195 3.4843 1.5069 11.3595 2.5642 1.4629 2.7313 2.4094 1.8982 2.6330 5.3689 1.7289 1.4423 1.6239 5.2506 3.5553 3.8247 1.7058 1.3293 1.2930 1.3564 1.6858 1.3340 3.2655 3.3972 2.1174 4.6252 1.2563 1.8344 1.4119 1.7828 1.4985 1.3851 1.4492 1.4199 1.2044 2.1121 1.4487 1.6363 1.6611 3.3326 1.8528 3.4716 1.5757 1.4449 3.2497 2.0672 2.6157 3.1650 3.6175 1.0583 1.0895 4.3215 1.4464 1.3665 2.6892 2.8094 2.3628 1.0549 1.0558 1.3626 1.7136 1.2305 2.4684 7.4275 4.3971 7.4774 7.4228 3.5113 6.6054 6.0064 6.7939 1.0328 1.0320 1.0248 1.1044 1.1047 1.0857 1.0996 1.0898 1.1015 1.0894 1.0865 1.0953 1.0993 1.0954 1.0959 1.1069 1.0925 1.1070 1.0920 1.0743 1.0746
irintensity: 1.3130 2.4185 4.0928 1.9084 1.7081 2.6004 5.6056 34.7790 1.2625 8.6470 38.9021 0.2514 0.5621 0.7899 14.4250 3.5978 6.8274 32.3930 19.7190 22.6964 4.4364 4.4714 4.6981 6.0465 12.6179 4.9334 18.9645 5.0694 0.8224 2.4572 37.4645 44.7696 16.2117 6.6167 9.3280 4.0466 4.8324 1.8675 12.9117 15.4759 10.5583 6.2157 22.3945 129.0403 8.5878 34.1330 77.1241 36.5440 17.3708 16.1337 5.7558 3.9446 21.8911 1.0637 5.6443 2.6307 81.2818 64.6917 11.2118 16.0672 11.4732 27.1082 35.8273 48.1587 6.9457 1.7578 48.0389 32.4260 2.9506 8.8618 0.6605 1.2617 2.5664 56.1356 1.1365 7.0055 0.3717 62.4434 59.9604 12.1091 20.4186 0.1099 43.9592 3.3844 41.5513 35.8426 3.7414 78.1706 93.0801 3.9603 71.3375 55.7500 10.5348 33.6344 84.3425 102.9339 20.1021 43.7395 6.7572 102.9888 130.0488 123.7541 73.2558 35.9650 11.3506 10.6729 193.6085 52.0218 4.0662 62.2247 51.9407 38.8050 15.5082 17.3026 114.8837 36.7499 31.7739 64.6059 55.6266 415.7587 75.7421 6.5801 70.4831 413.3492 243.5969 129.9197 72.2731 47.4322 3.1402 42.1931 25.4136 0.6455 28.2348 6.7995 15.0729 15.1857 1.0463 22.9031 41.1727 7.7988 3.5229 1.8982 2.6031 1.1077 1.4882 8.0180 84.7293
temp: 298.150 k
press: 1.00000 atm
elementType: 16 8 8 8 8 7 7 7 6 6 6 6 6 6 6 6 6 6 6 6 6 6 6 6 6 6 6 6 6 6 1 1 1 1 1 1 1 1 1 1 1 1 1 1 1 1 1 1 1 1 1
symmnumber: 1
zpe: 1013872.2 jmol-1
zpe.correction: 0.386164 hartree
zpe.thermalcorrener: 0.414949 hartree
zpe.thermalcorrenthalpy: 0.415894 hartree
zpe.thermalcorrgfe: 0.324149 hartree
zpe.sumelectzpe: -1711.837810 hartree
zpe.sumelectthermal: -1711.809024 hartree
zpe.sumelectthermalent: -1711.808080 hartree
zpe.sumelectthermalfe: -1711.899825 hartree
dipole: 0.9019 -3.6390 -0.5183
dipole: 3.7848
quadrupole: -194.4380 -156.4797 -179.8065
quadrupole: -11.3785 -9.8134 -5.0164
quadrupole: -17.5300 20.4284 -2.8984 -11.3785 -9.8134 -5.0164
hfenergy: -1712.2239738 hartree
pointgroup: C01 [X(C22H21N3O4S1)]
dipole: -0.6023004 -1.3076286 -0.3802866 debye
polarizability: 626.7589012|-140.3528185|449.8841914|59.0819423|57.436113|226.4715456 unknown
InChI: InChI=1S/C21H18N3O2.CH3O2S/c1-25-14-8-9-16-19(12-14)23-17-6-4-3-5-15(17)21(16)24-18-10-7-13(22)11-20(18)26-2;1-4(2)3/h3-12,22,24H,1-2H3;1H3
charge 0 multiplicity 1
51 atoms
S  -5.547457 2.096902 -0.55405
O  -1.542556 -1.221679 -2.749831
O  3.732676 4.066831 1.749222
O  -5.528026 3.59232 0.137636
O  -4.919031 1.908884 -2.065185
N  0.432613 -0.924463 -1.047704
N  4.293652 -0.581916 0.835591
N  -4.839025 0.274629 0.554693
C  1.688052 -0.787467 -0.395122
C  2.145228 0.467097 0.113413
C  2.542679 -1.932021 -0.316416
C  3.461575 0.508417 0.755218
C  3.857381 -1.762637 0.297231
C  -0.83284 -0.590944 -0.569758
C  1.419768 1.699245 -0.020469
C  2.160071 -3.236711 -0.7863
C  3.936182 1.74417 1.297972
C  -1.934424 -0.75978 -1.481746
C  4.742954 -2.896496 0.360169
C  -1.106358 -0.134629 0.752344
C  -3.512222 0.005866 0.229137
C  3.179788 2.911899 1.184341
C  1.912867 2.891987 0.497868
C  -3.244257 -0.48408 -1.093258
C  -2.412802 0.191823 1.132265
C  3.043466 -4.310767 -0.703881
C  4.35174 -4.136368 -0.134959
C  -7.384038 1.583382 -0.680919
C  -2.582875 -1.313249 -3.783549
C  2.98359 5.323698 1.637029
H  0.41991 -1.399002 -1.957366
H  0.462768 1.707084 -0.549095
H  1.153324 -3.393312 -1.189354
H  4.91293 1.757632 1.786892
H  5.724413 -2.73446 0.815896
H  -0.283009 -0.027794 1.463228
H  1.33385 3.811084 0.369139
H  -4.087964 -0.597413 -1.775981
H  -2.606617 0.575501 2.141103
H  2.737943 -5.299951 -1.061757
H  5.034442 -4.991434 -0.080976
H  -4.916938 0.629421 1.533859
H  -7.808363 1.664904 0.329028
H  -7.845521 2.291471 -1.383395
H  -7.38599 0.550797 -1.051671
H  -3.083836 -0.336782 -3.916212
H  -3.328833 -2.087215 -3.521749
H  -2.052952 -1.598837 -4.703591
H  3.60359 6.068221 2.156947
H  1.996182 5.251872 2.131917
H  2.852401 5.62347 0.579652
