program: Gaussian 09
title: 000149855
version: EM64L-G09RevD.01
frameworkgroup: C1[X(C19H14O4S)]
method: RPBEPBE
basis: SDD
operation: Freq
keyword: #p
keyword: freq=noraman
keyword: PBEPBE/SDD
title: #p freq=noraman PBEPBE/SDD
converged: NO YES NO NO
title: Mulliken charges:
elementType: S O O O O C C C C C C C C C C C C C C C C C C C H H H H H H H H H H H H H H
charge: 0.969231 -0.256936 -0.617174 -0.425114 -0.561111 0.137931 0.188742 0.208126 0.343201 0.418806 0.227766 -0.613850 -0.275262 0.252981 -0.527060 -0.399444 -0.417764 -0.206228 -0.401129 -0.386353 -0.232409 -0.751336 -0.232688 -0.235537 0.265995 0.244060 0.376838 0.269015 0.251916 0.229944 0.247881 0.289103 0.237809 0.245426 0.233947 0.234679 0.241450 0.424546
chargesum: 0.00000
title: Mulliken charges with hydrogens summed into heavy atoms:
elementType: S O O O O C C C C C C C C C C C C C C C C C C C
charge: 0.969231 -0.256936 -0.192628 -0.425114 -0.561111 0.137931 0.188742 0.208126 0.343201 0.418806 0.227766 -0.103795 -0.275262 0.252981 -0.150222 -0.130429 -0.165847 0.023716 -0.153248 -0.097250 0.005401 -0.271962 0.001991 0.005913
polarizability: 3.59214107e+02 -2.17802499e+01 3.27022617e+02 2.43899443e+01 2.12112772e+01 1.43113738e+02
1716.lowfreq: -6.8614 -0.0011 -0.0008 -0.0007 5.0887 7.3462 41.3523 47.5130 62.1235
frequency: 41.3414 47.4489 62.0948 82.0014 109.3204 120.4369 132.7854 140.5966 159.5519 184.4671 191.4446 221.4119 246.5739 263.8448 280.5623 307.8358 320.5823 327.0158 357.5440 382.5762 397.7574 403.1751 430.8512 434.0766 467.8290 484.2961 494.2842 504.3994 530.2067 549.0155 567.5223 583.7513 605.9838 619.2894 652.0096 657.6606 661.6846 693.4690 710.2915 724.0944 743.4503 753.5469 775.1966 783.4213 802.2902 816.9880 837.3278 853.8132 888.9764 897.1157 910.0784 918.5740 927.6359 942.9702 952.6179 975.7234 982.9409 985.3744 1002.5711 1015.7955 1035.0106 1056.6359 1087.7573 1097.9520 1135.6282 1156.5994 1160.2307 1170.2651 1177.9620 1186.8410 1187.4971 1238.2734 1246.4889 1257.2977 1294.4386 1318.8306 1337.0585 1346.0466 1364.7960 1380.4659 1382.9743 1411.9452 1419.1712 1444.7618 1452.2099 1468.0225 1506.9738 1516.1538 1560.4013 1569.7991 1597.6713 1608.7976 1624.2405 1639.3357 2892.0726 2917.6550 2957.0670 3061.4463 3125.4435 3132.9175 3134.5184 3135.0524 3148.7222 3158.1570 3161.4015 3167.5321 3172.0275 3243.6404
redmass: 5.4797 6.7042 9.3754 8.3141 4.9087 7.2317 3.9996 8.2541 6.9384 7.2496 5.2638 6.8393 3.9233 4.4458 5.1880 7.1711 4.4477 8.1702 3.8920 5.4997 6.0488 6.4057 4.0351 4.7533 6.5114 4.6514 3.8908 4.3814 5.2688 6.3120 4.0175 11.6853 5.2535 4.2674 3.4457 2.4007 3.1641 3.1080 3.3674 1.4537 4.0424 3.7397 3.5363 1.5888 1.2516 2.7962 4.1587 3.9611 11.3833 1.4857 1.8188 1.4334 2.3665 2.2392 1.5518 1.4308 1.5694 1.9074 1.3514 2.8770 2.4746 2.2343 2.8046 1.8950 1.8868 2.4847 1.1158 1.1616 1.0804 1.7166 1.2554 1.4961 1.3640 1.4279 2.1449 2.4377 2.8281 2.1441 2.3829 2.2858 5.5732 1.5200 1.7458 1.7313 2.2552 2.3775 7.4669 8.2478 6.4375 5.2939 4.5166 6.3934 6.2192 6.2121 1.0694 1.0754 1.0854 1.0874 1.0855 1.0798 1.0917 1.0699 1.0891 1.0946 1.1004 1.0920 1.1005 1.1104
irintensity: 0.1086 0.8568 0.1244 1.2718 1.5312 0.6175 0.4094 13.5034 0.4166 10.1338 1.4673 4.7538 2.5074 3.3688 6.4236 13.4623 3.7752 6.9827 12.0005 7.3559 13.5293 2.5131 8.8842 21.2656 37.5931 10.7961 23.7284 20.9734 6.3243 6.2979 3.4918 59.2929 38.3829 1.8892 17.6308 4.3622 47.9616 7.3108 27.9529 59.4398 75.5838 6.5893 16.7286 59.5735 212.4658 19.9664 32.6472 16.0391 91.6192 2.9290 3.0549 48.4518 5.5079 7.7050 51.6602 4.5059 1.5846 7.3236 0.2894 15.8683 2.7791 5.5539 9.9398 1.2176 0.6826 7.8973 24.6093 0.6114 2.8091 4.7488 3.7812 2.3031 9.3080 4.8490 35.3642 154.0747 25.0002 9.6624 32.6368 5.6221 7.4658 11.2860 6.8038 28.4950 28.5612 10.0405 131.9406 120.8973 13.3798 46.1455 12.1630 73.7806 22.7964 13.9005 7.2980 637.0432 8.3260 16.5358 0.3184 3.5612 15.5135 1.3721 8.2911 9.9890 41.6680 3.4270 26.5481 7.4477
temp: 298.150 k
press: 1.00000 atm
elementType: 16 8 8 8 8 6 6 6 6 6 6 6 6 6 6 6 6 6 6 6 6 6 6 6 1 1 1 1 1 1 1 1 1 1 1 1 1 1
symmnumber: 1
zpe: 728308.5 jmol-1
zpe.correction: 0.277398 hartree
zpe.thermalcorrener: 0.297318 hartree
zpe.thermalcorrenthalpy: 0.298262 hartree
zpe.thermalcorrgfe: 0.229692 hartree
zpe.sumelectzpe: -1429.568216 hartree
zpe.sumelectthermal: -1429.548296 hartree
zpe.sumelectthermalent: -1429.547352 hartree
zpe.sumelectthermalfe: -1429.615922 hartree
dipole: 3.0746 7.4536 -0.6177
dipole: 8.0865
quadrupole: -124.7326 -142.3114 -149.3967
quadrupole: -10.1951 1.0275 4.1042
quadrupole: 14.0810 -3.4979 -10.5831 -10.1951 1.0275 4.1042
hfenergy: -1429.8456137 hartree
pointgroup: C01 [X(C19H14O4S1)]
dipole: 1.9153914 2.53312 0.1903499 debye
polarizability: 349.7159534|-25.8596311|334.8558611|-34.3732802|-14.2724276|144.7786475 unknown
InChI: InChI=1S/C19H14O4S/c1-11-12-6-2-5-9-15(12)19(20)16-10-17(23-24(21)22)13-7-3-4-8-14(13)18(11)16/h2-7,9-10,17,21H,1,8H2
charge 0 multiplicity 1
38 atoms
S  -0.81301 -4.065309 -1.009002
O  -2.731503 -0.835641 0.562481
O  -2.139094 -2.86685 -1.216644
O  0.777497 -3.024207 -0.990271
O  -0.912174 -4.685811 0.488519
C  0.665026 0.413095 -0.19825
C  1.968572 -0.101436 -0.315122
C  -0.366029 -0.448656 0.411467
C  0.244177 1.792539 -0.556313
C  2.254874 -1.475049 0.104283
C  -0.961997 2.346723 0.144135
C  3.148363 0.715082 -0.830374
C  -1.770037 0.017894 0.534712
C  -1.989808 1.471959 0.614882
C  -0.114778 -1.731081 0.835955
C  1.121224 -2.428082 0.388749
C  3.5598 -1.920316 0.26751
C  4.52111 0.186631 -0.498771
C  -1.164523 3.744512 0.297723
C  -3.20041 1.982008 1.151764
C  4.708212 -1.071154 0.01081
C  0.835256 2.557764 -1.535496
C  -2.35431 4.248732 0.860916
C  -3.386611 3.369157 1.277652
H  3.05139 1.774915 -0.510054
H  3.095657 0.768941 -1.944379
H  -0.875311 -2.302798 1.374185
H  1.421314 -3.263808 1.04179
H  3.7277 -2.946149 0.616591
H  5.37578 0.833631 -0.731707
H  -0.378605 4.442952 -0.006865
H  -3.966855 1.26805 1.469255
H  5.714068 -1.45214 0.216015
H  1.6475 2.19601 -2.164724
H  0.43755 3.543059 -1.795476
H  -2.479894 5.330756 0.978638
H  -4.312508 3.768576 1.703864
H  -2.348912 -2.2595 -0.41105
