program: Gaussian 09
title: 000145983
version: EM64L-G09RevD.01
frameworkgroup: C1[X(C7H16ClO2P)]
method: RPBEPBE
basis: SDD
operation: Freq
keyword: #p
keyword: freq=noraman
keyword: PBEPBE/SDD
title: #p freq=noraman PBEPBE/SDD
converged: NO YES NO NO
title: Mulliken charges:
elementType: Cl P O O C C C C C C C H H H H H H H H H H H H H H H H
charge: -0.235860 1.036981 -0.536537 -0.569995 0.312730 0.020972 -0.714646 -0.735905 -0.730215 -0.733628 -0.876731 0.240273 0.226370 0.209938 0.219652 0.236268 0.210164 0.213404 0.219158 0.217201 0.216249 0.243212 0.222022 0.237005 0.284237 0.286569 0.281114
chargesum: 0.00000
title: Mulliken charges with hydrogens summed into heavy atoms:
elementType: Cl P O O C C C C C C C
charge: -0.235860 1.036981 -0.536537 -0.569995 0.312730 0.261244 -0.058686 -0.076069 -0.077607 -0.031389 -0.024811
polarizability: 1.35637070e+02 4.63516762e+00 1.19276374e+02 3.47910813e+00 4.24862184e-01 9.97694425e+01
1716.lowfreq: -0.2185 -0.0026 -0.0018 -0.0011 7.5935 16.2561 34.4001 48.5916 62.0289
frequency: 26.6509 48.2535 61.9987 117.6577 127.5573 173.1405 176.0795 180.5798 206.6069 218.1911 229.8780 239.8045 250.8169 273.1297 292.4818 323.9768 355.7004 358.6244 371.2313 409.6614 433.1602 460.7217 517.2027 672.3056 717.0128 735.7199 856.5398 870.2894 928.8517 931.4419 944.9525 945.5273 963.1421 988.9697 1003.5113 1036.2804 1063.5735 1077.3600 1122.1575 1211.7967 1226.0554 1268.8021 1316.8657 1339.2177 1347.1822 1375.8255 1376.2273 1395.3478 1404.4146 1429.7312 1432.9348 1456.8183 1464.5632 1466.2765 1468.7451 1479.0407 1485.4253 1492.9667 1499.9121 2973.4588 2977.1121 2980.2457 2983.1569 3000.5129 3027.5710 3067.6159 3070.4349 3074.1130 3078.5702 3082.5599 3086.4058 3096.6782 3107.2232 3150.0782 3162.6601
redmass: 4.4291 3.5905 3.8157 3.8582 4.4761 1.4535 1.0310 2.0321 2.2413 1.9009 1.2070 1.2150 4.2761 2.5828 1.7008 3.2987 2.5672 2.7522 4.0889 6.5477 3.2349 3.0544 2.8008 5.3676 3.0549 4.3304 3.9005 2.7127 1.6650 1.6520 1.3073 1.3905 1.3255 1.4663 1.4682 1.6748 4.5604 1.4712 2.4925 2.3425 2.8940 3.0322 1.2878 1.3503 1.1630 1.2082 1.1955 1.2220 1.2007 1.0443 1.0449 1.0497 1.0477 1.0522 1.0486 1.0499 1.0523 1.0525 1.0652 1.0358 1.0357 1.0662 1.0535 1.0365 1.0312 1.0996 1.0997 1.0998 1.0988 1.0994 1.0989 1.0987 1.1001 1.1024 1.1027
irintensity: 1.8537 0.3259 0.8059 10.4196 0.1198 1.1908 0.0731 2.0394 3.7689 0.3576 0.4656 0.5598 1.7874 0.5532 0.5007 12.7303 1.0226 6.7054 27.1163 75.4590 24.4559 5.7321 15.8706 25.0374 1.6186 26.7845 160.2456 169.4819 2.3409 1.2268 2.3171 5.8764 56.7216 16.6951 11.4347 30.8884 90.3675 46.9164 15.9603 14.7322 3.7405 3.2900 6.8274 3.9560 18.0067 21.4027 17.3631 36.5989 15.9232 10.9975 12.0737 0.2748 2.4376 6.4404 3.9075 18.9231 15.8918 4.6527 24.1867 27.7646 32.7452 14.9355 11.9010 14.6624 0.2661 7.4670 9.4047 28.3296 72.1978 21.4719 63.1214 19.0133 19.2926 0.4921 0.1752
temp: 298.150 k
press: 1.00000 atm
elementType: 17 15 8 8 6 6 6 6 6 6 6 1 1 1 1 1 1 1 1 1 1 1 1 1 1 1 1
symmnumber: 1
zpe: 583582.0 jmol-1
zpe.correction: 0.222275 hartree
zpe.thermalcorrener: 0.237800 hartree
zpe.thermalcorrenthalpy: 0.238745 hartree
zpe.thermalcorrgfe: 0.179463 hartree
zpe.sumelectzpe: -1227.172096 hartree
zpe.sumelectthermal: -1227.156571 hartree
zpe.sumelectthermalent: -1227.155627 hartree
zpe.sumelectthermalfe: -1227.214909 hartree
dipole: -2.2288 -1.0306 2.7538
dipole: 3.6896
quadrupole: -82.4734 -82.2431 -87.9567
quadrupole: -6.9371 7.8242 -5.7377
quadrupole: 1.7510 1.9813 -3.7323 -6.9371 7.8242 -5.7377
hfenergy: -1227.3943711 hartree
pointgroup: C01 [X(C7H16Cl1O2P1)]
dipole: 0.6922514 1.0168428 0.7706956 debye
polarizability: 135.940803|5.0487695|113.0403801|-0.3865384|-9.0440661|105.7017041 unknown
InChI: InChI=1S/C7H16O2P.Cl/c1-6(7(2,3)4)9-10(5)8;/h6H,1-5H3;
charge 0 multiplicity 1
27 atoms
Cl -3.100617 -1.688671 -0.178838
P  -1.770432 -0.056921 -1.12369
O  -0.456387 0.084906 -0.030277
O  -1.417434 -0.384377 -2.638826
C  2.00928 -0.01448 -0.19704
C  0.711438 -0.8774 -0.121233
C  1.919953 0.922231 -1.432708
C  2.198435 0.834914 1.085674
C  3.217862 -0.973675 -0.382912
C  0.579773 -1.837651 1.066596
C  -2.730988 1.474076 -0.725529
H  0.613175 -1.430671 -1.079021
H  1.697887 0.353951 -2.355388
H  2.87898 1.452763 -1.577185
H  1.127848 1.679975 -1.301399
H  1.307141 1.458168 1.278237
H  3.070595 1.504569 0.969565
H  2.378384 0.203555 1.974888
H  4.140908 -0.383228 -0.528419
H  3.372725 -1.622034 0.497971
H  3.089601 -1.619753 -1.272428
H  -0.373881 -2.388982 1.005817
H  1.40231 -2.574154 1.063626
H  0.599157 -1.289661 2.023098
H  -3.711841 1.409209 -1.219131
H  -2.860557 1.533911 0.36435
H  -2.174513 2.349232 -1.095798
