program: Gaussian 09
title: 000146744
version: EM64L-G09RevD.01
frameworkgroup: C1[X(C16H19O2PS)]
method: RPBEPBE
basis: SDD
operation: Freq
keyword: #p
keyword: freq=noraman
keyword: PBEPBE/SDD
title: #p freq=noraman PBEPBE/SDD
converged: NO YES NO NO
title: Mulliken charges:
elementType: S P O O C C C C C C C C C C C C C C C C H H H H H H H H H H H H H H H H H H H
charge: -0.034166 0.933379 -0.501385 -0.624102 -0.151507 -0.887566 -0.285188 -0.227870 0.446052 0.533779 -0.365809 -0.367985 -0.230932 -0.381183 -0.382089 -0.802343 -0.646708 -0.221131 -0.222748 -0.241921 0.319498 0.281236 0.276327 0.267201 0.238519 0.237904 0.225253 0.232728 0.233586 0.284892 0.228770 0.241176 0.228643 0.208484 0.228606 0.247935 0.225355 0.227335 0.227974
chargesum: 0.00000
title: Mulliken charges with hydrogens summed into heavy atoms:
elementType: S P O O C C C C C C C C C C C C C C C C
charge: -0.034166 0.933379 -0.501385 -0.624102 -0.151507 -0.286831 -0.008860 0.039331 0.446052 0.533779 -0.127291 -0.130081 0.227049 -0.147598 -0.097197 -0.103753 0.038317 0.004224 0.004587 -0.013947
polarizability: 3.34734500e+02 -9.23745633e+00 1.76487993e+02 6.68123227e+00 5.99060239e+00 1.74296635e+02
1716.lowfreq: -31.2583 -14.7828 -5.8233 -1.6872 0.0014 0.0019 0.0021 15.8651 19.7324
frequency: -31.1954 15.8536 19.2560 31.3905 40.0135 54.3385 59.0974 68.6869 98.6116 105.3446 131.6302 138.6786 155.1415 199.5299 216.7541 259.1432 271.0918 274.9359 301.6256 311.2229 339.8463 370.3917 380.7695 399.9931 405.8173 435.4102 462.0395 471.4556 512.7180 550.3398 604.4124 616.1262 617.2821 627.1317 650.3757 707.7232 718.9367 774.5387 790.9295 804.0961 805.5117 827.5436 856.8814 861.5227 868.3972 871.2529 936.5469 962.4504 980.3249 984.0649 986.8038 988.4337 992.3756 1004.9703 1010.9019 1015.6112 1027.0203 1048.1179 1078.5029 1093.9896 1097.1728 1124.2428 1147.5257 1160.4378 1172.6239 1189.3534 1195.4750 1222.1611 1222.5119 1251.7347 1264.5556 1304.0794 1331.4514 1347.0093 1368.3731 1383.3200 1391.6537 1396.8404 1399.7058 1433.4439 1442.5077 1458.5924 1468.5928 1472.6982 1473.2735 1482.9933 1486.3035 1487.9635 1578.6368 1591.1054 1609.6213 1612.0185 2978.2168 2987.7491 2992.9027 3024.9357 3060.6296 3071.7412 3085.4207 3090.0588 3104.6393 3107.1872 3117.4291 3120.6512 3129.4306 3131.4260 3132.6468 3143.7802 3153.9877 3161.0232 3164.8482
redmass: 1.0137 5.6081 4.7623 3.7215 4.3741 4.6614 4.4206 3.2392 2.9521 5.1883 5.1456 3.5439 4.7521 4.5675 1.5639 5.8159 3.9043 5.6794 3.8213 6.0866 2.1088 3.4229 4.9457 2.8530 2.8749 5.3724 4.2634 5.3094 3.2422 5.5922 5.7639 6.2661 5.0141 6.8580 6.6658 1.7574 3.3020 2.0157 4.9316 2.5807 1.3286 1.3874 1.2464 1.3373 2.6422 1.7593 1.4177 1.3091 1.9337 1.9341 1.3739 3.7000 2.6362 1.3275 3.5646 3.0651 2.2164 1.5963 1.5762 2.2728 3.1252 1.3268 1.5478 1.0764 1.0511 1.1200 1.1216 2.9989 3.1078 1.1471 1.1181 1.2698 1.2590 1.2277 4.5614 8.0062 1.2291 1.2211 3.4567 1.1825 1.9975 1.0408 1.0926 1.0559 1.0694 2.2450 1.0740 2.3761 6.1899 6.0391 6.1493 5.9528 1.0388 1.0382 1.0614 1.0589 1.0947 1.1018 1.0974 1.1000 1.1069 1.1026 1.0854 1.0883 1.0886 1.0893 1.0921 1.0962 1.0963 1.1015 1.0961
irintensity: 0.5355 0.3766 0.1646 0.0856 1.0107 0.3047 1.5001 0.4138 0.3717 0.8469 1.3290 4.4146 6.5572 7.4027 4.9856 2.4852 10.3351 5.9301 3.3458 2.3507 3.6125 1.5651 3.7131 0.2196 0.0180 48.6231 5.0480 96.7320 93.1735 9.0479 131.2275 0.2932 17.5442 6.5876 65.5903 61.4927 8.4025 30.6375 2.1790 5.0191 7.2953 31.4964 0.5588 10.6240 88.7685 18.4742 7.2373 0.2549 16.0807 16.7003 0.2767 0.7665 27.3332 2.3438 25.2598 107.2659 11.2610 24.5792 9.8671 21.8922 36.0976 6.2850 11.0697 2.5458 0.2115 2.6857 11.2719 1.1373 13.5739 11.7983 0.7086 3.0737 0.8433 13.4616 0.5795 0.2834 30.7089 13.7749 8.9356 16.3566 8.2664 12.4753 16.2660 13.4852 0.7918 14.3482 12.8129 18.9484 0.2535 1.0822 22.3283 3.4308 30.2950 17.4035 22.6836 12.7564 20.0831 5.6576 28.4285 15.7220 1.3101 35.9174 3.8551 2.2910 12.1666 15.4526 6.5596 32.0045 9.2652 35.4685 3.9128
temp: 298.150 k
press: 1.00000 atm
elementType: 16 15 8 8 6 6 6 6 6 6 6 6 6 6 6 6 6 6 6 6 1 1 1 1 1 1 1 1 1 1 1 1 1 1 1 1 1 1 1
symmnumber: 1
zpe: 810593.1 jmol-1
zpe.correction: 0.308739 hartree
zpe.thermalcorrener: 0.329554 hartree
zpe.thermalcorrenthalpy: 0.330499 hartree
zpe.thermalcorrgfe: 0.255507 hartree
zpe.sumelectzpe: -1509.372433 hartree
zpe.sumelectthermal: -1509.351617 hartree
zpe.sumelectthermalent: -1509.350673 hartree
zpe.sumelectthermalfe: -1509.425664 hartree
dipole: 1.6622 0.1643 -1.2843
dipole: 2.1069
quadrupole: -103.3117 -129.2779 -135.4850
quadrupole: -5.5160 3.0724 -2.9347
quadrupole: 19.3798 -6.5863 -12.7935 -5.5160 3.0724 -2.9347
hfenergy: -1509.6811715 hartree
pointgroup: C01 [X(C16H19O2P1S1)]
dipole: 0.5544141 -0.3320763 -0.5191213 debye
polarizability: 309.6656861|-57.8630844|205.4539687|5.3898811|2.4188878|170.3994728 unknown
InChI: InChI=1S/C9H12O2P.C7H7S/c1-3-11-12(10)9-6-4-8(2)5-7-9;8-6-7-4-2-1-3-5-7/h4-7H,3H2,1-2H3;1-5H,6H2
charge 0 multiplicity 1
39 atoms
S  -1.005291 -1.374252 -0.709504
P  0.731483 0.002465 -0.023708
O  0.948165 1.058192 -1.384722
O  0.392946 0.639555 1.411985
C  2.319005 -0.928729 -0.099111
C  -2.163866 -1.06054 0.805092
C  2.91283 -1.321024 1.122333
C  2.929396 -1.248065 -1.332836
C  4.758129 -2.377547 -0.123833
C  -3.18074 0.026626 0.567001
C  4.125354 -2.041499 1.101447
C  4.141496 -1.969172 -1.336163
C  -0.150395 1.992141 -1.766107
C  -4.428236 -0.259165 -0.046773
C  -2.90125 1.35972 0.970792
C  6.076123 -3.129902 -0.138314
C  -0.054402 3.308206 -0.989762
C  -5.377293 0.76555 -0.257793
C  -3.850938 2.384222 0.760225
C  -5.090974 2.091477 0.14477
H  -1.484756 -0.810583 1.637649
H  -2.621069 -2.049323 0.971969
H  2.43398 -1.05531 2.071138
H  2.470821 -0.925532 -2.272591
H  4.586247 -2.346864 2.048132
H  4.616278 -2.21842 -2.292469
H  0.002721 2.141557 -2.8482
H  -1.126545 1.491178 -1.610258
H  -4.653461 -1.286082 -0.36065
H  -1.936415 1.575427 1.446362
H  6.176101 -3.755859 -1.042153
H  6.93063 -2.425487 -0.130577
H  6.180909 -3.782357 0.74586
H  -0.837159 4.005938 -1.34298
H  0.930728 3.781395 -1.143188
H  -0.197569 3.139305 0.091102
H  -6.338436 0.53184 -0.729773
H  -3.627301 3.40786 1.082279
H  -5.828543 2.886162 -0.015269
