program: Gaussian 09
title: 000146965
version: EM64L-G09RevD.01
frameworkgroup: C1[X(C19H24N2O)]
method: RPBEPBE
basis: SDD
operation: Freq
keyword: #p
keyword: freq=noraman
keyword: PBEPBE/SDD
title: #p freq=noraman PBEPBE/SDD
converged: NO YES NO NO
title: Mulliken charges:
elementType: O N N C C C C C C C C C C C C C C C C C C C H H H H H H H H H H H H H H H H H H H H H H H H
charge: -0.289089 -0.435655 0.001046 0.380068 -0.478852 -0.559045 0.261854 -0.050035 -0.744538 -0.741680 0.097799 0.383607 0.322057 -0.634475 -0.879780 -0.815787 -0.466348 0.414495 -0.359800 -0.482047 -0.182654 -0.336556 0.221350 0.207922 0.224126 0.223355 0.245349 0.228477 0.208306 0.230390 0.227471 0.202322 0.241444 0.223407 0.240047 0.256737 0.234132 0.208111 0.236939 0.304292 0.226284 0.210774 0.246848 0.272336 0.231940 0.243056
chargesum: 0.00000
title: Mulliken charges with hydrogens summed into heavy atoms:
elementType: O N N C C C C C C C C C C C C C C C C C C C
charge: -0.289089 -0.131363 0.001046 0.380068 -0.049580 -0.111564 0.261854 -0.050035 -0.062406 -0.081497 0.097799 0.383607 0.322057 -0.393031 -0.159588 -0.136605 -0.029289 0.414495 -0.112952 -0.209711 0.049286 -0.093501
polarizability: 3.37551878e+02 -7.23947295e+00 2.04799062e+02 -9.92614060e+00 -8.78367710e+00 1.47861061e+02
1716.lowfreq: -10.2786 -6.6310 -3.2367 0.0003 0.0006 0.0009 13.4689 20.5826 43.8762
frequency: 12.0372 20.2609 43.8620 52.8454 87.6957 92.0307 115.8585 121.9903 134.9662 153.4926 166.2248 189.3255 201.8052 213.6349 220.3593 252.4036 264.4784 276.1360 296.4298 301.4435 339.8372 350.9010 375.4719 386.7487 387.3930 416.1300 438.8917 455.6697 460.6054 475.7709 486.3722 519.2765 556.9444 566.7718 603.1295 617.5315 634.7878 667.4614 674.3895 723.0846 727.4514 750.2913 797.2229 821.2835 843.7118 847.9906 859.7159 883.7022 911.1082 929.4388 929.7342 937.8810 972.3956 985.4521 986.3238 994.1424 1005.5411 1015.3225 1021.4916 1027.2216 1029.4909 1037.4211 1044.8677 1068.1496 1070.0308 1114.8727 1122.5980 1156.8864 1168.8421 1192.6297 1201.7187 1210.4092 1225.4983 1235.1279 1244.6262 1252.8565 1263.2653 1302.7266 1319.5099 1330.6179 1336.3086 1351.5509 1366.2070 1375.0054 1377.7634 1391.4329 1397.3075 1398.0619 1412.6658 1420.3529 1439.3276 1447.4011 1454.8526 1455.5138 1456.8809 1462.8156 1467.5057 1469.9551 1472.1384 1482.0553 1485.0980 1490.7492 1495.5578 1511.7815 1558.8664 1588.6478 1598.1992 1620.2323 2890.6137 2943.7490 2961.7945 2968.8476 2978.5746 2985.4513 2988.0590 2992.6050 3011.4172 3023.1342 3052.5679 3056.1470 3081.5885 3083.8532 3090.4467 3091.5791 3096.1016 3100.6299 3126.5420 3132.4231 3135.2434 3141.4055 3165.6590 3558.3284
redmass: 4.1924 4.6364 4.8273 3.6748 2.9989 2.5142 1.2570 1.8279 4.0769 1.6023 1.1019 2.1404 2.8065 2.5550 1.6074 1.8262 2.7455 2.6818 2.6441 2.7396 2.8335 2.1134 4.9328 2.3262 2.2829 2.0056 3.2654 4.1339 3.5408 3.8943 3.1621 3.3874 4.3697 4.2610 3.9921 6.7122 4.7342 4.7047 4.0082 2.0360 3.0338 3.2339 1.9038 3.0843 1.5048 3.3434 2.3242 2.5378 1.8624 1.3349 1.5044 1.3926 2.2103 1.4948 1.4943 1.6886 3.5553 1.7661 1.6369 3.1878 1.5890 1.6222 1.5261 4.8426 2.2147 1.5784 1.7479 2.0933 2.6624 1.4282 1.8049 1.7539 1.6892 1.9383 1.6771 1.7112 2.4536 3.2788 2.1634 1.5575 1.5004 1.5905 2.6846 1.4689 2.2582 1.2230 1.3844 1.2180 2.5051 2.6305 1.8333 1.0680 1.0666 1.1313 2.0263 1.1187 1.1532 1.1184 1.1182 1.0479 1.2308 1.0916 1.1255 1.7107 5.5371 5.9048 6.6548 6.3990 1.0695 1.0443 1.0653 1.0888 1.0361 1.0367 1.0443 1.0519 1.0939 1.0932 1.1030 1.0967 1.0988 1.1002 1.0991 1.1004 1.0995 1.0924 1.0878 1.0914 1.0925 1.0901 1.0998 1.0764
irintensity: 1.8441 0.7522 1.1181 0.8858 0.7256 0.8239 1.3926 0.2867 0.1168 4.6974 0.9371 0.3399 0.4399 0.6312 0.1400 0.2482 4.4134 0.3092 4.1971 3.6199 2.9784 53.1253 5.7931 34.3546 8.6054 66.9174 1.5394 1.9844 1.3302 4.3720 8.7108 1.3248 4.2021 0.5237 0.3259 3.4769 3.5384 3.1928 1.1555 35.6466 2.0254 3.7668 26.1566 9.7822 22.0577 8.4515 17.6148 21.7299 7.6218 2.0981 3.7110 3.1381 43.6714 3.5578 0.5391 11.1733 9.2433 45.4415 11.5956 0.7439 4.8074 0.3803 6.9079 50.1153 10.0957 6.8106 81.5909 29.7230 123.6900 1.8562 7.0001 61.8402 2.7105 5.1065 48.7254 34.2000 26.0456 4.3455 5.2649 2.6650 1.7953 9.9345 2.7715 26.5637 50.3975 23.8711 34.2363 0.3379 154.4644 22.8019 7.8381 1.9458 8.0599 5.2984 31.8832 17.8077 9.9304 10.4673 7.3989 10.6264 158.3879 62.7156 12.0910 93.5082 8.2192 0.4975 17.1140 52.1188 85.0535 49.3720 31.1662 23.3987 38.0672 22.5503 7.1064 58.9497 23.1526 29.0037 33.2124 19.2682 14.4809 26.0310 46.5391 16.3999 38.8320 20.3499 3.5310 28.3004 14.8495 26.4583 29.3267 18.1115
temp: 298.150 k
press: 1.00000 atm
elementType: 8 7 7 6 6 6 6 6 6 6 6 6 6 6 6 6 6 6 6 6 6 6 1 1 1 1 1 1 1 1 1 1 1 1 1 1 1 1 1 1 1 1 1 1 1 1
symmnumber: 1
zpe: 1014642.7 jmol-1
zpe.correction: 0.386457 hartree
zpe.thermalcorrener: 0.408358 hartree
zpe.thermalcorrenthalpy: 0.409302 hartree
zpe.thermalcorrgfe: 0.334357 hartree
zpe.sumelectzpe: -921.527120 hartree
zpe.sumelectthermal: -921.505218 hartree
zpe.sumelectthermalent: -921.504274 hartree
zpe.sumelectthermalfe: -921.579220 hartree
dipole: -0.3130 -0.2564 -2.1070
dipole: 2.1455
quadrupole: -118.8527 -128.4490 -135.0305
quadrupole: 16.3672 -14.8313 2.2145
quadrupole: 8.5914 -1.0049 -7.5864 16.3672 -14.8313 2.2145
hfenergy: -921.9135765 hartree
pointgroup: C01 [X(C19H24N2O1)]
dipole: -0.1313372 -0.3355487 -0.7633373 debye
polarizability: 337.2210948|-11.5198205|195.3713915|-8.7047099|-22.9574251|157.6195145 unknown
InChI: InChI=1S/C19H24N2O/c1-13-10-17(21-12-15-6-5-9-20-11-15)14(2)16-7-8-19(3,4)22-18(13)16/h5-6,9-11,21H,7-8,12H2,1-4H3
charge 0 multiplicity 1
46 atoms
O  -3.912542 0.84051 -0.290105
N  1.63848 -0.242492 -0.213971
N  5.591408 -0.784615 1.402332
C  -4.886639 -0.169949 0.239485
C  -4.489488 -1.555373 -0.319634
C  -3.066806 -1.967122 0.113452
C  -2.061727 -0.831267 -0.060978
C  -2.535881 0.495657 -0.254782
C  -4.854801 -0.115082 1.782443
C  -6.240142 0.298797 -0.312047
C  -0.661154 -1.076103 -0.033695
C  -1.644189 1.578779 -0.466229
C  0.248874 0.005863 -0.249838
C  -0.259706 1.314238 -0.472977
C  -0.090515 -2.460414 0.232149
C  -2.183225 2.977504 -0.686986
C  2.633376 0.80464 -0.456626
C  4.040583 0.304792 -0.16643
C  5.095173 0.471631 -1.095621
C  4.348219 -0.331642 1.066296
C  6.391218 0.013762 -0.766216
C  6.592319 -0.606205 0.487674
H  -4.541676 -1.500589 -1.424177
H  -5.223985 -2.313827 0.011033
H  -2.755133 -2.843789 -0.484782
H  -3.077907 -2.307026 1.169789
H  -3.839531 -0.304164 2.171198
H  -5.16929 0.884262 2.130107
H  -5.539877 -0.868001 2.214638
H  -6.440763 1.337635 0.002815
H  -6.240675 0.267179 -1.41545
H  -7.055714 -0.346027 0.062359
H  0.423751 2.148689 -0.66045
H  0.426226 -2.878571 -0.658155
H  0.652474 -2.428317 1.054079
H  -0.864841 -3.186681 0.521514
H  -2.80128 3.305131 0.169415
H  -1.362083 3.701849 -0.825885
H  -2.842401 3.017701 -1.573791
H  1.949626 -1.199796 -0.377635
H  2.406816 1.664114 0.208623
H  2.589159 1.20004 -1.499168
H  4.903452 0.951448 -2.06272
H  3.562079 -0.483525 1.815101
H  7.226668 0.129133 -1.463926
H  7.580771 -0.976574 0.782679
