program: Gaussian 09
title: 000145880
version: EM64L-G09RevD.01
frameworkgroup: C1[X(C10H12BrNO)]
method: RPBEPBE
basis: SDD
operation: Freq
keyword: #p
keyword: freq=noraman
keyword: PBEPBE/SDD
title: #p freq=noraman PBEPBE/SDD
converged: YES YES NO NO
title: Mulliken charges:
elementType: Br O N C C C C C C C C C C H H H H H H H H H H H H
charge: -0.057033 -0.270400 -0.337250 -0.542484 0.498070 -0.522401 0.311175 -0.433878 -0.361878 -0.636250 -0.217509 -0.229017 -0.237699 0.229826 0.264868 0.314416 0.309280 0.231065 0.249153 0.261907 0.247590 0.241372 0.228060 0.228151 0.230866
chargesum: 0.00000
title: Mulliken charges with hydrogens summed into heavy atoms:
elementType: Br O N C C C C C C C C C C
charge: -0.057033 -0.270400 -0.022835 -0.047790 0.498070 -0.213121 0.311175 -0.202813 -0.112725 0.114619 0.010551 -0.000866 -0.006833
polarizability: 1.52741545e+02 1.30029726e+01 1.31310563e+02 -6.49360783e+00 1.07035580e+01 1.06377394e+02
1716.lowfreq: -20.6597 -10.7761 -6.7971 0.0002 0.0005 0.0006 3.6905 24.9211 36.3261
frequency: -15.1063 24.8365 36.0343 39.0671 127.0286 166.1932 222.1165 242.5577 264.4610 292.3483 296.9332 317.2944 379.5047 403.4764 472.5121 559.3291 600.9240 608.1171 617.3027 670.3065 704.0871 707.4808 757.5034 806.4629 842.2973 856.4620 921.5036 961.6391 979.1340 990.2451 996.2438 1001.7188 1025.5534 1035.1953 1063.9914 1086.5223 1099.1297 1173.2451 1189.2526 1190.4593 1214.4617 1233.2074 1256.4426 1283.1087 1327.3763 1353.7381 1384.5126 1385.7797 1441.6447 1462.3757 1465.0370 1471.6078 1484.5647 1503.5240 1595.3075 1597.2738 1614.4389 2996.0804 3001.2199 3061.1758 3083.6000 3097.8872 3116.2281 3116.4846 3123.8862 3135.8021 3147.2709 3164.4110 3505.3114
redmass: 4.5298 4.6090 5.1739 5.3519 6.3825 4.0417 5.9122 1.3214 2.2418 3.2376 4.3286 4.2886 3.1174 2.8069 3.5198 4.6556 3.3704 3.6647 5.7549 1.2219 3.3642 2.1120 1.9374 3.6578 2.9158 1.2466 1.4120 1.8403 1.3937 5.9316 1.4152 1.7249 2.2621 2.2991 2.0753 1.7119 2.3778 1.0542 1.1225 1.2327 2.5977 1.3417 1.7949 1.3763 1.2809 1.3587 1.4414 3.3027 2.1557 1.0511 1.1408 1.0572 2.1106 1.9208 6.4347 7.7132 5.9906 1.0352 1.0597 1.1029 1.0894 1.0966 1.1002 1.0877 1.0864 1.0913 1.0961 1.1015 1.0780
irintensity: 0.0945 0.8896 9.2612 0.0423 3.0821 2.4267 6.3773 1.1874 3.9439 2.7030 2.7427 7.1259 17.2630 0.3391 14.2428 5.8119 0.5118 83.5064 0.9117 109.7414 14.3130 49.5513 41.4941 5.9735 6.9796 0.0581 3.5408 18.2216 0.0449 0.0774 3.6835 5.6482 9.0715 4.0659 35.5420 22.9481 7.3543 0.1018 2.7185 41.6936 2.8670 11.4495 52.9757 2.4023 6.8715 8.7025 16.9826 4.3992 20.4693 21.9786 25.5511 5.8338 2.9289 241.6049 28.0407 173.2102 4.4248 9.2949 32.9252 7.1841 0.4345 9.8630 18.4451 10.3679 1.1118 11.5049 37.1325 21.2494 48.7472
temp: 298.150 k
press: 1.00000 atm
elementType: 35 8 7 6 6 6 6 6 6 6 6 6 6 1 1 1 1 1 1 1 1 1 1 1 1
symmnumber: 1
zpe: 522482.4 jmol-1
zpe.correction: 0.199003 hartree
zpe.thermalcorrener: 0.211242 hartree
zpe.thermalcorrenthalpy: 0.212186 hartree
zpe.thermalcorrgfe: 0.157545 hartree
zpe.sumelectzpe: -530.754269 hartree
zpe.sumelectthermal: -530.742030 hartree
zpe.sumelectthermalent: -530.741085 hartree
zpe.sumelectthermalfe: -530.795727 hartree
dipole: -1.3435 -1.3976 0.7365
dipole: 2.0738
quadrupole: -82.1034 -92.2148 -82.9728
quadrupole: 6.7510 -0.0910 8.2415
quadrupole: 3.6603 -6.4511 2.7909 6.7510 -0.0910 8.2415
hfenergy: -530.953272 hartree
pointgroup: C01 [X(C10H12Br1N1O1)]
dipole: 0.6255462 0.4861365 -0.1950615 debye
dipolederiv: -0.2790976 0.057783 -0.0126403 0.1732575 -0.3395388 0.2668573 -0.1539886 0.2378319 -0.5849677 -0.7830089 0.1768249 -0.1231795 -0.1441086 -0.7216823 0.3542639 0.3261275 0.2843658 -0.6298363 -1.2735463 -0.1177842 0.113131 -0.0390148 -0.4402573 -0.0408659 0.1857922 -0.0070282 -0.4831757 0.5842815 -0.018333 0.059039 -0.2756237 0.2338576 0.1023644 0.2297206 0.1276657 0.2476043 0.099762 0.1251831 0.0454708 0.2027206 -0.0159114 0.0046428 0.0561906 0.0077918 -0.0176675 -0.0046438 0.089458 -0.0546531 -0.1092283 0.3743557 -0.4047725 0.2814253 -0.400079 0.8716427 1.414445 -0.2240368 -0.0744276 0.2434668 0.5486559 -0.3707186 -0.8293898 -0.3266149 0.4729627 -0.1518021 0.002206 -0.0476056 -0.0103779 -0.1016896 0.0930149 -0.0890002 0.0908831 0.0289667 -0.0264284 0.0129805 -0.0719441 -0.0187933 -0.141789 -0.0081578 -0.1255427 0.00423 -0.0737782 -0.0153864 0.036431 0.0138126 0.0507807 -0.0207924 0.1055282 -0.0086048 -0.0104726 -0.1978736 0.0595254 0.0567407 -0.0977542 0.0323345 -0.1072756 0.0187435 -0.1052337 0.0156144 -0.020749 -0.0640601 0.0245244 -0.0438382 0.0324987 -0.0788551 0.1052649 -0.0246855 0.1005863 0.0859717 -0.0167388 0.107634 0.0253281 0.0921431 -0.0722293 0.0652158 0.0280977 0.06696 -0.0728821 -0.0547909 0.0581544 0.0596088 0.0543157 0.0635099 -0.0531686 0.0206981 -0.1288775 -0.0783148 0.0760555 -0.0983655 0.010446 0.0216335 0.0424481 0.0153575 -0.0748373 0.0716347 0.0431111 0.2978022 -0.0106952 0.0762539 -0.0055828 0.2399379 0.0518284 0.1016381 0.0509456 0.2388661 0.0053706 -0.0185433 -0.0346385 -0.0489988 -0.0254983 0.0246657 -0.0124068 0.0579366 -0.0241353 0.1090462 -0.0269134 0.0019497 -0.0066427 0.0789571 -0.1137027 0.0236033 -0.1066209 -0.0630285 -0.01826 -0.0382827 0.095341 -0.040477 0.1100366 0.000947 0.111633 -0.0104738 0.0723527 0.1427779 0.0065855 0.0002819 -0.013894 0.0384125 0.053908 0.0043797 0.0720804 -0.0508685 -0.0873198 0.0935941 -0.0053658 0.1083252 0.0531057 -0.0287908 -0.0219921 -0.0015553 0.1009084 -0.0073535 -0.1184835 -0.023327 -0.0950094 0.0031627 -0.0524761 -0.0012046 -0.0100882 0.0884567 -0.0680933 -0.0484781 0.1001906 -0.0569197 0.1264487 -0.0130766 0.1130594 -0.0087013 0.0408542 0.0869568 -0.0148848 0.0337648 -0.0243859 0.0880841 -0.1051159 0.011381 -0.1080215 -0.0695306 -0.0254932 -0.1132992 -0.0452443 -0.1224195 0.0645468 -0.0717569 -0.0468607 -0.069993 0.0751105 unknown
polarizability: 156.8797234|9.7215671|101.8793545|-2.8706497|-1.8660413|131.6704244 unknown
InChI: InChI=1S/C10H12BrNO/c1-8(11)10(13)12-7-9-5-3-2-4-6-9/h2-6,8,12H,7H2,1H3
charge 0 multiplicity 1
25 atoms
Br -3.412447 0.999781 -2.186227
O  -2.207138 -1.873511 0.66451
N  -1.055439 -0.750884 -1.028919
C  0.212874 -1.484309 -0.844586
C  1.336045 -0.601174 -0.309325
C  -3.438613 -0.167831 -0.478345
C  -2.16088 -0.999435 -0.261056
C  2.524209 -0.40729 -1.054417
C  1.20493 0.028545 0.955641
C  -3.74986 0.728707 0.728667
C  3.567251 0.403131 -0.547639
C  2.24336 0.838241 1.462809
C  3.428537 1.028511 0.711837
H  0.510334 -1.936424 -1.809061
H  -0.013286 -2.303094 -0.137089
H  -1.107224 -0.012618 -1.736822
H  -4.264801 -0.867418 -0.682297
H  2.636566 -0.891795 -2.032757
H  0.290928 -0.126815 1.541573
H  -3.797981 0.090568 1.629906
H  -4.718396 1.237972 0.598738
H  -2.96555 1.490574 0.875288
H  4.482291 0.545624 -1.133354
H  2.134228 1.316424 2.442728
H  4.235165 1.656521 1.106193
