program: Gaussian 09
title: 000145799
version: EM64L-G09RevD.01
frameworkgroup: C1[X(C12H9Cl)]
method: RPBEPBE
basis: SDD
operation: Freq
keyword: #pfreq=noraman
keyword: PBEPBE/SDD
title: #p freq=noraman PBEPBE/SDD
converged: NO YES NO YES
title: Mulliken charges:
elementType: Cl C C C C C C C C C C C C H H H H H H H H H
charge: -0.062181 -0.170032 -0.543847 -0.547530 0.450243 0.323470 0.514828 -0.371201 -0.427176 -0.439476 -0.441805 -0.235477 -0.216197 0.248823 0.248817 0.237454 0.237442 0.242167 0.241600 0.240529 0.247964 0.221583
chargesum: 0.00000
title: Mulliken charges with hydrogens summed into heavy atoms:
elementType: Cl C C C C C C C C C C C C
charge: -0.062181 -0.170032 -0.046206 -0.072633 0.450243 0.323470 0.514828 -0.371201 -0.185009 -0.197876 -0.201275 0.012487 0.005385
polarizability: 1.99614671e+02 1.34666307e+00 1.50595317e+02 2.65800872e-03 1.46196575e-03 5.95904603e+01
1716.lowfreq: -0.0006 -0.0003 0.0012 7.4016 9.0030 11.4955 87.2899 96.5456 180.3570
frequency: 87.2560 96.5356 180.3570 204.7708 212.6478 289.9105 330.5987 440.9849 444.3915 488.4072 504.1074 511.8321 551.8890 573.2593 635.3014 636.8550 669.6739 752.1231 771.6424 813.8997 816.9698 850.4062 850.7347 906.1502 950.4102 957.7775 980.3274 1003.5344 1008.6824 1033.9544 1084.7329 1118.8673 1145.7202 1174.5044 1189.9821 1203.6189 1222.7839 1239.7738 1251.5527 1289.3756 1353.2369 1390.7644 1409.9412 1442.5708 1458.5284 1465.1141 1469.7861 1499.7082 1594.4089 1609.4624 1623.8742 2995.9313 3008.3879 3039.5931 3060.9192 3122.1526 3134.9338 3136.4655 3154.8035 3165.6038
redmass: 4.4922 2.0510 8.5951 3.6518 3.1088 4.7870 11.6076 4.2803 3.4468 4.6296 3.7141 6.8579 2.6548 7.0291 5.8567 3.7625 6.3681 1.8871 1.2284 1.5017 4.6801 2.1262 6.6651 1.4009 3.3258 1.3463 1.3729 4.5318 1.9379 2.5238 3.3998 2.0384 1.1723 1.2587 1.4131 1.0994 1.3303 1.8459 1.9706 1.7479 3.4364 4.1516 1.8791 1.3546 2.8190 1.6092 2.0694 4.2286 6.7333 9.4507 7.8326 1.0594 1.0618 1.1028 1.1022 1.0859 1.0920 1.0887 1.0985 1.0957
irintensity: 0.0001 0.0101 0.8267 1.9313 12.0637 0.2510 3.9096 1.8272 0.0839 6.1909 2.1936 4.1565 0.6814 9.2673 0.5101 3.7229 1.1576 15.3387 18.4250 32.3583 2.0210 56.0390 49.6405 0.6224 3.4693 0.5518 2.0457 2.1211 0.9013 0.3180 37.6756 14.8042 0.1705 0.9770 4.2819 0.0366 2.1030 0.3789 6.0703 5.4851 14.8181 2.0622 7.3353 10.0814 3.6151 15.9303 15.3913 12.1302 25.3060 17.4668 0.0497 16.9721 33.4860 0.5113 26.0020 1.0653 12.3180 11.3587 37.6177 10.4605
temp: 298.150 k
press: 1.00000 atm
elementType: 17 6 6 6 6 6 6 6 6 6 6 6 6 1 1 1 1 1 1 1 1 1
symmnumber: 1
zpe: 446281.8 jmol-1
zpe.correction: 0.169980 hartree
zpe.thermalcorrener: 0.179779 hartree
zpe.thermalcorrenthalpy: 0.180724 hartree
zpe.thermalcorrgfe: 0.134324 hartree
zpe.sumelectzpe: -921.865403 hartree
zpe.sumelectthermal: -921.855604 hartree
zpe.sumelectthermalent: -921.854660 hartree
zpe.sumelectthermalfe: -921.901059 hartree
dipole: 2.0106 0.5647 0.0001
dipole: 2.0884
quadrupole: -81.9301 -69.9338 -86.0286
quadrupole: 0.9466 0.0000 0.0003
quadrupole: -2.6326 9.3637 -6.7311 0.9466 0.0000 0.0003
hfenergy: -922.0353832 hartree
pointgroup: C01 [X(C12H9Cl1)]
dipole: 0.7975684 -0.1974316 -0.0000256 debye
dipolederiv: -0.8907135 -0.1051596 0.0000243 -0.238463 -0.1649095 0.0000115 0.000039 0.0000096 -0.0754664 0.0221873 -0.0223988 0.0000017 0.0227503 -0.2195052 -0.000008 -0.0000275 0.0000006 -0.046802 0.0803791 -0.0994187 0.0000365 -0.001993 -0.0904225 0.0000421 0.0000318 0.0002092 0.1450666 0.0364201 0.013544 0.000019 -0.0990339 -0.0719288 -0.0000667 -0.000041 -0.000224 0.1566044 -0.3536658 -0.0307651 0.0000061 0.0053311 0.244258 -0.0000346 0.0000178 -0.0001641 0.016941 -0.028426 0.151403 0.00003 0.0330572 0.3133679 0.0000573 0.0000447 0.0001653 -0.0301066 0.208748 -0.0652773 0.0000056 -0.0576298 -0.1240912 -0.0000024 0.0000125 -0.0000043 0.0931046 1.2520974 0.2951142 -0.0000562 0.3002381 0.0186949 -0.0000106 -0.0000756 0.0000082 -0.1092538 -0.0408279 -0.2243052 -0.0000209 -0.0708055 -0.0647401 -0.0000014 -0.0000095 -0.0000116 -0.1897586 -0.0572381 0.0013313 -0.0000043 -0.0548138 0.0934185 0.0000086 0.0000021 0.0000036 -0.1966928 -0.1065127 0.0701478 0.0000001 0.1205009 0.0495649 -0.0000012 0.0000022 0.0000012 -0.2033661 -0.2500464 -0.0860065 0.0000136 -0.006978 0.0639323 0.0000019 0.0000288 -0.0000008 -0.0987758 0.0699107 0.0901172 0.0000148 0.004237 0.0871814 0.0000059 0.0000192 0.0000074 -0.1435051 0.0230961 -0.0153673 0.0700195 -0.0204577 0.0112152 0.0493657 0.0842523 0.0926564 -0.024854 0.0229778 -0.0154657 -0.0700548 -0.0205245 0.0111955 -0.0493874 -0.084267 -0.0926837 -0.0246634 0.0360096 -0.0003742 0.040698 0.0214794 -0.0213648 -0.0829385 0.0488606 -0.139793 -0.0322594 0.03596 -0.0002481 -0.0407304 0.0215715 -0.0215014 0.0829718 -0.0488662 0.1398351 -0.0320518 -0.0272689 0.0942348 0.0000047 0.11786 -0.0185586 -0.0000058 0.0000034 -0.0000094 0.1571507 0.0512403 -0.0579881 0.0000012 -0.0056946 -0.0981336 -0.0000002 -0.0000046 0.0000027 0.1610813 0.056951 -0.0218688 -0.000001 -0.0849704 -0.0994088 -0.0000051 -0.000007 -0.0000061 0.162062 -0.0011812 0.0930633 0.0000001 0.0739455 0.0316938 0.0000012 -0.0000041 -0.0000025 0.1598624 -0.140097 -0.0643121 -0.0000079 -0.0596069 0.0700422 -0.000004 -0.0000115 0.0000002 0.1556829 unknown
polarizability: 199.6509621|0.1822278|150.5590261|-0.0027023|0.0013785|59.5904603 unknown
InChI: InChI=1S/C12H9Cl/c13-11-7-5-9-3-1-2-8-4-6-10(11)12(8)9/h1-3,5,7H,4,6H2
charge 0 multiplicity 1
22 atoms
Cl -3.825407 -0.275232 0.000064
C  0.280809 -0.111033 -0.000096
C  -0.997342 -2.152295 0.000116
C  0.542268 -2.501096 -0.000336
C  -1.047608 -0.62978 -0.00005
C  1.25736 -1.149393 -0.000141
C  0.599392 1.282452 -0.000071
C  -2.086674 0.292379 -0.000021
C  2.608417 -0.794756 -0.000112
C  -0.512935 2.191362 -0.000052
C  1.994299 1.618457 -0.000053
C  -1.827266 1.701709 -0.000041
C  2.960506 0.599815 -0.000061
H  -1.511329 -2.567906 0.886213
H  -1.512019 -2.568275 -0.885396
H  0.815912 -3.101307 -0.887868
H  0.816377 -3.101984 0.886584
H  3.400531 -1.552089 -0.000132
H  -0.340607 3.273576 -0.000051
H  2.303962 2.670043 -0.000029
H  -2.67529 2.393715 -0.000038
H  4.022544 0.871538 -0.000028
