program: Gaussian 09
title: 000145994
version: EM64L-G09RevD.01
frameworkgroup: C1[X(C14H17NO3S)]
method: RPBEPBE
basis: SDD
operation: Freq
keyword: #p
keyword: freq=noraman
keyword: PBEPBE/SDD
title: #p freq=noraman PBEPBE/SDD
converged: YES YES NO NO
title: Mulliken charges:
elementType: S O O O N C C C C C C C C C C C C C C H H H H H H H H H H H H H H H H H
charge: -0.051036 -0.275662 -0.409974 -0.228864 -0.257841 -0.047995 -0.441552 -0.400939 -0.583368 0.151689 0.422522 0.241985 -0.822481 -0.476788 -0.398658 -0.360191 -0.245490 -0.239115 0.219942 0.262196 0.237151 0.205226 0.208302 0.212295 0.278254 0.207576 0.269365 0.293450 0.269972 0.301050 0.239316 0.247537 0.230337 0.233399 0.124888 0.383502
chargesum: 0.00000
title: Mulliken charges with hydrogens summed into heavy atoms:
elementType: S O O O N C C C C C C C C C C C C C C
charge: 0.073852 -0.275662 -0.026471 -0.228864 -0.257841 0.214201 0.000825 0.019657 -0.097539 0.151689 0.422522 0.241985 -0.259666 0.094234 -0.159342 -0.112654 -0.015153 -0.005716 0.219942
polarizability: 1.64798532e+02 1.83009904e+01 1.79503926e+02 6.20839000e+00 -4.58944338e+00 1.81218181e+02
1716.lowfreq: -8.6067 -0.0010 0.0015 0.0023 1.5929 6.5174 8.9682 39.8712 46.9829
frequency: 6.9417 39.8214 46.9336 59.7296 87.7355 95.6545 114.5772 120.5085 169.6758 200.4143 221.4080 237.6316 277.0757 298.8950 308.1139 323.6608 334.5444 340.6136 363.3191 410.5154 440.2327 463.7094 469.5428 493.5535 537.5553 558.1369 569.8199 621.3320 631.0709 645.7002 673.8486 692.9483 710.0554 744.4351 765.5007 773.7531 788.8067 839.0259 852.2836 854.5557 870.2204 884.7519 911.3502 954.4224 971.4409 989.2227 999.1264 1017.3054 1025.3792 1044.6495 1053.1218 1056.7331 1079.4148 1097.9036 1122.9460 1151.7876 1173.7993 1182.6065 1201.5497 1214.0897 1229.7185 1243.7478 1258.9800 1260.5654 1266.3672 1294.6065 1296.8324 1325.9069 1335.0199 1341.3522 1349.1002 1364.1799 1377.5206 1387.4835 1408.7382 1422.2086 1440.6402 1461.3533 1471.0832 1484.1651 1492.5539 1572.0862 1585.7676 1609.0541 1678.9765 2443.6565 2968.9013 2978.8774 2998.8861 3012.7631 3022.5302 3029.4745 3040.7918 3044.1694 3064.2317 3086.4252 3119.6535 3121.0365 3132.0513 3145.6612 3165.6485 3522.0737
redmass: 5.6581 7.7827 8.9233 10.7377 4.8450 5.0541 4.3386 5.0438 4.1215 2.6484 4.8013 2.5252 3.3884 1.2680 2.8805 3.0336 3.9991 4.4665 3.3607 5.0621 2.4140 2.1863 3.1727 3.4083 4.0801 3.6049 3.6778 1.9501 1.9816 5.2731 3.4032 4.4388 3.8981 3.3963 1.8014 1.5799 1.8960 3.1535 2.1019 2.7268 1.8282 1.7833 2.1859 1.4112 1.7229 1.3274 3.1212 3.2282 3.5559 2.3292 1.9647 2.8348 2.6130 2.5475 1.9367 1.2332 1.0791 1.2227 1.6136 1.3432 1.4622 1.3686 1.2460 1.7949 1.9178 1.3847 1.4068 1.3693 1.5905 1.3743 1.5410 1.6023 5.4787 1.9514 1.1588 1.1072 2.4068 1.1020 1.0901 2.5190 1.1096 7.1750 6.8725 6.4816 8.7224 1.0379 1.0598 1.0624 1.0647 1.0607 1.0940 1.0912 1.0580 1.0990 1.1003 1.0990 1.1069 1.0871 1.0881 1.0940 1.1008 1.0642
irintensity: 0.0217 1.0286 1.6599 1.3777 1.4851 0.2975 2.6376 1.1575 0.9306 0.9775 0.2739 2.1047 3.2706 35.9817 18.0141 6.3454 0.1554 1.9137 2.0995 29.5191 1.3190 13.6788 8.2795 12.7623 5.3511 67.9658 1.7598 65.7278 63.9388 6.7111 10.6363 14.2167 18.8921 5.8243 35.0805 18.4930 4.8045 1.6092 1.5596 1.0353 3.7378 5.6468 7.6296 0.1629 2.5340 0.1199 33.8076 18.5807 160.1846 51.7965 11.5285 110.8645 36.8606 8.8393 12.3733 1.0700 0.3021 1.5818 1.7526 57.6660 9.0536 8.5817 5.7103 38.4518 25.0304 6.7536 18.2781 8.4395 10.2904 5.5194 9.5387 34.8267 3.3496 64.6881 67.4413 34.5871 16.0403 12.7254 26.1229 45.4501 14.5999 239.1617 0.2992 3.9369 177.3555 8.8367 17.7319 51.8741 21.1384 25.7654 23.1540 15.8545 23.4477 47.3272 6.9093 1.3624 5.0097 6.4471 3.8303 23.1801 22.7702 32.1434
temp: 298.150 k
press: 1.00000 atm
elementType: 16 8 8 8 7 6 6 6 6 6 6 6 6 6 6 6 6 6 6 1 1 1 1 1 1 1 1 1 1 1 1 1 1 1 1 1
symmnumber: 1
zpe: 747907.1 jmol-1
zpe.correction: 0.284863 hartree
zpe.thermalcorrener: 0.303059 hartree
zpe.thermalcorrenthalpy: 0.304004 hartree
zpe.thermalcorrgfe: 0.236393 hartree
zpe.sumelectzpe: -1220.776548 hartree
zpe.sumelectthermal: -1220.758351 hartree
zpe.sumelectthermalent: -1220.757407 hartree
zpe.sumelectthermalfe: -1220.825018 hartree
dipole: -3.2570 -1.8570 0.1964
dipole: 3.7544
quadrupole: -124.0657 -112.0045 -115.7523
quadrupole: -4.5264 7.9747 -4.6153
quadrupole: -6.7915 5.2696 1.5218 -4.5264 7.9747 -4.6153
hfenergy: -1221.0614108 hartree
pointgroup: C01 [X(C14H17N1O3S1)]
dipole: -1.1705122 0.8423781 -0.3195257 debye
polarizability: 168.2206173|-13.9322878|183.6270979|-12.4387233|-8.1326142|173.6729244 unknown
InChI: InChI=1S/C14H17NO3S/c16-13(17)8-15-12-7-2-1-4-10(12)5-3-6-11(9-19)14(15)18/h1-2,4,7,11,16,19H,3,5-6,8-9H2
charge 0 multiplicity 1
36 atoms
S  3.389134 -0.749623 2.602306
O  1.750065 -2.12921 -0.06921
O  -2.546654 -3.313532 -0.71231
O  -1.428017 -1.746964 -2.015615
N  -0.081064 -0.772303 0.365746
C  2.211106 0.264346 0.159463
C  2.474773 0.76475 -1.301072
C  1.438939 1.768273 -1.857707
C  -0.047429 1.29636 -1.810064
C  1.286094 -0.960944 0.134317
C  -0.707359 1.506746 -0.455536
C  -0.70291 0.520527 0.571273
C  3.550353 -0.132442 0.81477
C  -0.923029 -1.974184 0.417427
C  -1.346444 2.743746 -0.172217
C  -1.321019 0.770706 1.822363
C  -1.970233 2.996046 1.067314
C  -1.959269 2.001393 2.073374
C  -1.620499 -2.28167 -0.906424
H  1.754029 1.076881 0.752334
H  2.545498 -0.117942 -1.966111
H  3.470489 1.252502 -1.322316
H  1.704017 1.974372 -2.913583
H  1.527277 2.73226 -1.317264
H  -0.119044 0.236911 -2.113925
H  -0.612458 1.880722 -2.56025
H  4.210908 0.747592 0.884728
H  4.051503 -0.922281 0.233765
H  -1.69017 -1.884728 1.204065
H  -0.276308 -2.840236 0.652389
H  -1.362686 3.513444 -0.953561
H  -1.273813 0.005037 2.605114
H  -2.462535 3.957692 1.248876
H  -2.429293 2.187607 3.044865
H  2.932653 -2.011164 2.25702
H  -2.977304 -3.543489 -1.579647
