program: Gaussian 09
title: 000145853
version: EM64L-G09RevD.01
frameworkgroup: C1[X(C12H12N2S)]
method: RPBEPBE
basis: SDD
operation: Freq
keyword: #p
keyword: freq=noraman
keyword: PBEPBE/SDD
title: #p freq=noraman PBEPBE/SDD
converged: YES YES NO NO
title: Mulliken charges:
elementType: S N N C C C C C C C C C C C C H H H H H H H H H H H H
charge: 0.189627 -0.672555 -0.700446 -0.385651 -0.220730 0.530001 -0.133563 -0.242063 -0.237834 0.496089 -0.407902 -0.419771 -0.402657 -0.272745 -0.198794 0.255540 0.238747 0.251858 0.215900 0.217392 0.216914 0.227386 0.220407 0.326536 0.301326 0.304108 0.302881
chargesum: 0.00000
title: Mulliken charges with hydrogens summed into heavy atoms:
elementType: S N N C C C C C C C C C C C C
charge: 0.189627 -0.044692 -0.093458 -0.385651 -0.220730 0.530001 0.121977 -0.003317 0.014024 0.496089 -0.192001 -0.202379 -0.185743 -0.045359 0.021613
polarizability: 2.29051603e+02 -1.45147575e+01 1.40120702e+02 -1.70967830e+01 3.68529914e+00 1.22869605e+02
1716.lowfreq: -7.4649 -5.0984 -0.0005 0.0012 0.0023 3.2752 16.7734 29.9525 49.1113
frequency: 15.6317 29.9217 49.1073 114.8139 150.5336 213.5765 242.7083 262.0147 302.0395 330.7993 354.6914 359.7706 370.4705 377.1207 396.7466 407.3175 445.4526 465.6185 485.8615 507.5366 546.9391 555.2258 606.8475 632.0994 662.6018 707.9132 729.2232 754.4754 808.6906 812.8075 820.0833 829.4486 845.5930 930.7200 939.9131 951.9359 969.6782 989.1657 999.2965 1015.6317 1034.6471 1040.7101 1071.9639 1127.1363 1134.7616 1169.2395 1186.3466 1265.7172 1298.6391 1308.8852 1326.0906 1375.0103 1384.2613 1424.5041 1441.3574 1484.3962 1491.0429 1569.9034 1577.3199 1601.7571 1622.7587 1628.9369 1642.4798 3116.1746 3116.9492 3119.7774 3135.8707 3141.4377 3144.8767 3149.6260 3168.0311 3532.5918 3570.3996 3690.1791 3710.7153
redmass: 4.2932 4.0745 5.3471 5.1529 4.2025 4.7267 5.9813 4.2467 3.4927 1.4238 1.0452 3.9700 1.2083 7.6100 3.1302 2.7578 3.3592 1.6343 1.8647 2.5617 5.5615 4.0562 6.7760 6.9237 6.5533 3.0927 2.6596 1.4486 1.3090 5.0281 1.7310 5.1326 1.5028 1.3546 1.3621 1.3476 1.3130 4.0456 2.6226 1.4337 2.4761 1.9861 2.8588 1.2230 1.3367 1.0550 1.1055 1.5845 1.3169 2.7998 1.9179 5.1500 7.1804 3.5264 2.6003 3.0883 2.8443 6.3154 7.0134 2.0266 3.4784 2.0288 1.3469 1.0864 1.0873 1.0880 1.0891 1.0961 1.0937 1.0956 1.1001 1.0464 1.0448 1.1022 1.1040
irintensity: 1.7060 0.1809 0.5455 4.2279 0.1120 1.6950 1.1553 21.1690 24.9897 301.5143 0.1589 2.0902 163.6370 0.5442 2.0720 1.0015 3.1760 64.3376 37.5530 26.3216 0.2904 2.0895 10.8864 0.2206 4.8967 1.4547 4.0145 97.4367 8.8246 0.4594 69.9599 7.2406 4.0755 0.3688 2.6133 0.2884 0.1218 11.3809 4.8949 0.4866 9.5242 24.7064 2.0706 14.8144 11.2076 6.9601 31.2670 5.7797 3.3595 71.5145 13.7739 16.0500 17.0108 0.7588 6.9382 77.7070 192.2454 6.3866 4.3029 3.0994 27.6424 232.7006 243.6924 9.8887 12.9757 24.6488 9.8433 25.6863 23.1221 5.6575 25.6699 51.6023 76.3843 37.3653 19.8165
temp: 298.150 k
press: 1.00000 atm
elementType: 16 7 7 6 6 6 6 6 6 6 6 6 6 6 6 1 1 1 1 1 1 1 1 1 1 1 1
symmnumber: 1
zpe: 555034.5 jmol-1
zpe.correction: 0.211401 hartree
zpe.thermalcorrener: 0.225514 hartree
zpe.thermalcorrenthalpy: 0.226458 hartree
zpe.thermalcorrgfe: 0.168958 hartree
zpe.sumelectzpe: -970.987205 hartree
zpe.sumelectthermal: -970.973092 hartree
zpe.sumelectthermalent: -970.972148 hartree
zpe.sumelectthermalfe: -971.029649 hartree
dipole: -2.7921 -2.1603 2.3994
dipole: 4.2685
quadrupole: -74.7324 -91.0017 -89.5910
quadrupole: 0.1860 -0.9216 3.0488
quadrupole: 10.3760 -5.8933 -4.4826 0.1860 -0.9216 3.0488
hfenergy: -971.1986063 hartree
pointgroup: C01 [X(C12H12N2S1)]
dipole: -0.9676033 0.4799323 1.2859242 debye
polarizability: 222.9600296|-32.8976384|136.8499707|-3.7333074|-7.4751398|132.2319097 unknown
InChI: InChI=1S/C12H12N2S/c13-9-5-7-10(8-6-9)15-12-4-2-1-3-11(12)14/h1-8H,13-14H2
charge 0 multiplicity 1
27 atoms
S  0.36052 0.265037 -1.975119
N  1.666623 1.86255 0.336736
N  -4.678185 -0.133685 1.456715
C  1.720708 -0.280414 -0.85702
C  -1.129914 0.142979 -0.867656
C  2.223756 0.60667 0.150334
C  -1.198398 -0.750962 0.223713
C  -2.252589 0.944725 -1.180639
C  2.304222 -1.55068 -1.050986
C  -3.512113 -0.042018 0.690656
C  3.31462 0.156594 0.954916
C  -2.371029 -0.838376 0.999431
C  -3.433519 0.851657 -0.41639
C  3.390013 -1.980129 -0.254313
C  3.884065 -1.114576 0.75182
H  -0.333518 -1.374759 0.47422
H  -2.210615 1.644225 -2.023747
H  1.895832 -2.200096 -1.832704
H  3.713366 0.820508 1.731998
H  -2.405959 -1.532864 1.848034
H  -4.296139 1.478223 -0.674788
H  3.83656 -2.966365 -0.413982
H  4.723484 -1.431537 1.381828
H  0.907356 2.166178 -0.270991
H  2.01077 2.486302 1.05998
H  -4.735752 -0.775048 2.241619
H  -5.495866 0.42366 1.229937
