program: Gaussian 09
title: 000145704
version: EM64L-G09RevD.01
frameworkgroup: C1[X(C13H17NO)]
method: RPBEPBE
basis: SDD
operation: Freq
keyword: #p
keyword: freq=noraman
keyword: PBEPBE/SDD
title: #p freq=noraman PBEPBE/SDD
converged: YES YES NO NO
title: Mulliken charges:
elementType: O N C C C C C C C C C C C C C H H H H H H H H H H H H H H H H H
charge: -0.282062 -0.124899 -0.395045 -0.356414 -0.387581 -0.418343 -0.372618 -0.386827 0.125795 0.252686 -0.315554 -0.375274 -0.249001 -0.224721 -0.229716 0.186529 0.206251 0.201530 0.192776 0.197136 0.247608 0.215002 0.200438 0.196195 0.246575 0.246316 0.209777 0.241807 0.263243 0.228578 0.229550 0.230263
chargesum: 0.00000
title: Mulliken charges with hydrogens summed into heavy atoms:
elementType: O N C C C C C C C C C C C C C
charge: -0.282062 -0.124899 -0.002265 0.037892 0.057162 -0.002902 0.070152 0.069266 0.125795 0.252686 -0.073747 -0.112031 -0.020423 0.004829 0.000548
polarizability: 1.87491953e+02 -1.04911751e+01 1.31826755e+02 -1.20187423e+01 -1.50224769e+01 1.14986148e+02
1716.lowfreq: -22.9937 -6.5782 -0.0005 0.0005 0.0007 7.6762 41.8688 51.9104 74.1292
frequency: 41.2184 51.5890 73.9920 97.4860 156.0436 185.8543 206.1555 246.2327 286.2583 304.1095 328.4876 364.0085 397.8793 405.1585 421.4238 468.1962 496.9834 572.7736 613.5553 617.5583 684.2935 698.5282 707.4829 757.6236 786.5545 806.7009 825.5237 858.4861 875.3047 884.9076 892.3629 934.2643 967.3525 980.8585 989.7761 992.4310 998.9092 1001.4970 1027.3748 1063.3565 1081.4259 1097.7406 1111.1496 1130.3141 1172.6343 1173.8753 1187.8214 1190.2746 1212.6259 1239.6666 1265.6574 1274.0664 1298.9017 1315.7796 1336.3089 1339.3622 1343.4428 1352.0203 1363.8017 1369.7832 1378.8212 1400.5722 1430.4866 1445.2996 1461.0342 1462.8103 1471.1827 1475.8461 1478.6756 1481.1662 1543.0794 1588.6731 1609.4523 2947.2052 2957.8364 2973.5437 2978.9503 2986.5176 3001.9246 3018.0405 3027.9950 3032.7259 3056.8662 3069.7356 3075.9570 3124.6256 3133.7211 3145.6465 3156.4852 3168.0152
redmass: 3.5394 3.9905 4.2731 4.0380 2.7673 3.4349 2.5535 3.4031 4.2115 2.1570 3.0652 3.1201 3.4712 2.9704 2.8046 2.8397 1.7201 3.3751 6.3267 3.8818 3.7926 5.8837 1.5675 2.3798 2.2943 1.6931 1.8206 1.2466 1.8566 3.1969 1.8698 1.4317 2.2417 1.3884 4.8588 2.1306 1.3607 1.9370 2.1497 2.0747 1.6045 1.9103 1.9954 2.0492 1.1162 2.1158 1.1545 1.2427 1.7773 1.2938 1.3471 1.3852 1.4787 1.3307 1.3363 1.3444 1.4661 1.4056 1.3607 1.3280 7.7342 2.3950 2.2342 1.1642 1.0854 1.0876 1.0940 1.0781 1.1058 2.3055 6.4707 6.2005 6.0313 1.0682 1.0623 1.0619 1.0634 1.0642 1.0642 1.0971 1.0981 1.1013 1.0978 1.0938 1.1017 1.0847 1.0880 1.0929 1.0962 1.1009
irintensity: 0.0859 0.8023 3.4282 1.5123 1.8145 0.2330 0.3302 1.8822 0.6283 2.1695 0.3173 3.8931 8.6911 1.4575 2.9633 4.1852 4.0099 1.3901 0.1287 14.0462 11.6556 2.1743 88.3179 1.9223 26.0881 5.4219 12.0338 1.2743 3.9840 0.6613 9.6993 4.8657 7.4535 1.2534 0.5040 10.1327 1.1012 5.8864 8.6680 2.3025 15.0831 4.9009 31.2665 5.7660 1.0280 7.8748 5.5839 3.1779 15.2722 2.2539 10.0888 73.2281 56.2864 0.8854 5.8874 31.4339 13.8842 2.7335 3.6676 4.7023 0.6634 148.6392 11.7241 35.0523 9.8119 0.6902 13.0752 27.0831 1.2230 3.1527 193.1978 8.8036 2.5511 40.5483 35.8959 27.3665 37.5748 42.7643 43.8293 50.6969 35.6633 62.6251 50.8303 25.9188 15.5613 1.0060 4.0419 25.6611 24.1940 17.3786
temp: 298.150 k
press: 1.00000 atm
elementType: 8 7 6 6 6 6 6 6 6 6 6 6 6 6 6 1 1 1 1 1 1 1 1 1 1 1 1 1 1 1 1 1
symmnumber: 1
zpe: 717807.8 jmol-1
zpe.correction: 0.273399 hartree
zpe.thermalcorrener: 0.286757 hartree
zpe.thermalcorrenthalpy: 0.287701 hartree
zpe.thermalcorrgfe: 0.232982 hartree
zpe.sumelectzpe: -634.442142 hartree
zpe.sumelectthermal: -634.428784 hartree
zpe.sumelectthermalent: -634.427839 hartree
zpe.sumelectthermalfe: -634.482558 hartree
dipole: 0.8311 3.9702 0.2603
dipole: 4.0646
quadrupole: -78.5088 -96.3371 -86.7209
quadrupole: -2.1804 -3.2991 -5.2724
quadrupole: 8.6801 -9.1481 0.4680 -2.1804 -3.2991 -5.2724
hfenergy: -634.7155408 hartree
pointgroup: C01 [X(C13H17N1O1)]
dipole: 0.314032 -1.2786995 0.9074891 debye
polarizability: 186.259152|18.0695832|111.4871248|5.6200548|-10.6638061|136.5585796 unknown
InChI: InChI=1S/C13H17NO/c15-13(12-8-4-3-5-9-12)14-10-6-1-2-7-11-14/h3-5,8-9H,1-2,6-7,10-11H2
charge 0 multiplicity 1
32 atoms
O  0.113984 1.905679 -1.116976
N  0.978559 0.483947 0.509532
C  3.86036 -0.460062 -0.563976
C  2.924349 -1.657542 -0.2562
C  3.159682 0.911789 -0.692621
C  2.294818 -1.594769 1.159807
C  2.22918 1.284837 0.488278
C  0.968075 -0.797276 1.255804
C  -0.05427 0.922623 -0.317402
C  -1.402394 0.241804 -0.251324
C  -2.05685 -0.060074 0.971278
C  -2.089472 0.023207 -1.473452
C  -3.366357 -0.589683 0.969859
C  -3.38893 -0.525974 -1.475951
C  -4.031652 -0.835315 -0.253429
H  4.627001 -0.407533 0.238032
H  4.409963 -0.662065 -1.505057
H  2.123758 -1.719312 -1.021229
H  3.514732 -2.590699 -0.342447
H  3.93149 1.702092 -0.787366
H  2.552968 0.954948 -1.615656
H  2.067375 -2.61753 1.520697
H  3.042642 -1.182746 1.865898
H  2.744372 1.151999 1.458478
H  1.936308 2.34401 0.388645
H  0.149951 -1.41411 0.848819
H  0.742172 -0.618252 2.328624
H  -1.557465 0.144879 1.924845
H  -1.597071 0.307159 -2.40927
H  -3.867424 -0.804652 1.920289
H  -3.905045 -0.701284 -2.426369
H  -5.045311 -1.251594 -0.254357
