program: Gaussian 09
title: 000145437
version: EM64L-G09RevD.01
frameworkgroup: C1[X(C7H8)]
method: RPBEPBE
basis: SDD
operation: Freq
keyword: #p
keyword: freq=noraman
keyword: PBEPBE/SDD
title: #p freq=noraman PBEPBE/SDD
converged: YES YES NO NO
title: Mulliken charges:
elementType: C C C C C C C H H H H H H H H
charge: 0.125861 -0.515244 -0.515329 -0.115321 0.160936 -0.593581 -0.507725 0.255182 0.255755 0.254482 0.255115 0.236437 0.217872 0.206897 0.278662
chargesum: 0.00000
title: Mulliken charges with hydrogens summed into heavy atoms:
elementType: C C C C C C C
charge: 0.125861 -0.004307 -0.005733 0.121116 0.160936 -0.168812 -0.229062
polarizability: 1.00706726e+02 -6.50294911e+00 6.51908892e+01 1.43553228e-01 -6.66509434e-02 4.52511780e+01
1716.lowfreq: -20.7945 -14.7157 -9.5845 -0.0005 -0.0004 0.0005 36.3422 140.4552 191.5172
frequency: 35.1860 140.4477 191.5096 243.8547 301.0011 458.3670 509.9112 512.8696 599.4701 634.6971 655.1737 656.1744 781.7211 802.5466 901.8226 915.8209 935.0067 937.3103 1000.3466 1043.6786 1068.5060 1070.4161 1170.4044 1234.3699 1265.4338 1315.1664 1423.7592 1439.5673 1463.8129 1647.4839 2137.7484 3092.0246 3098.9137 3106.1118 3115.4998 3200.7021 3203.3538 3222.2579 3429.5155
redmass: 1.8597 3.6565 2.9443 2.9601 1.9200 3.0743 4.1625 6.0602 1.2105 3.4115 2.2071 1.2395 1.0352 4.6296 1.4993 1.3394 1.1269 2.9056 1.1516 1.1788 1.8576 1.3689 1.3374 2.6661 2.9599 1.4619 1.2453 1.0847 1.2072 4.6113 6.1769 1.0612 1.0502 1.0625 1.0939 1.1130 1.1183 1.1159 1.1572
irintensity: 1.0923 0.4195 3.2645 0.5137 3.0371 3.1607 1.9152 7.5025 76.6391 9.4899 4.7352 66.9687 0.5404 11.4053 7.5181 74.1581 0.2105 13.5742 16.9675 12.3848 26.0317 18.8995 0.0025 7.0530 4.2701 6.5555 7.7131 12.4449 9.8707 24.5972 29.0875 10.6151 16.7551 4.8990 6.0847 23.2849 0.0242 12.3996 80.2005
temp: 298.150 k
press: 1.00000 atm
elementType: 6 6 6 6 6 6 6 1 1 1 1 1 1 1 1
symmnumber: 1
zpe: 316782.9 jmol-1
zpe.correction: 0.120656 hartree
zpe.thermalcorrener: 0.128320 hartree
zpe.thermalcorrenthalpy: 0.129265 hartree
zpe.thermalcorrgfe: 0.088536 hartree
zpe.sumelectzpe: -270.901389 hartree
zpe.sumelectthermal: -270.893724 hartree
zpe.sumelectthermalent: -270.892780 hartree
zpe.sumelectthermalfe: -270.933509 hartree
dipole: -0.4599 0.6949 0.0131
dipole: 0.8334
quadrupole: -37.3497 -40.4517 -44.7213
quadrupole: -0.7190 0.0082 -0.0772
quadrupole: 3.4912 0.3892 -3.8804 -0.7190 0.0082 -0.0772
hfenergy: -271.0220449 hartree
pointgroup: C01 [X(C7H8)]
dipole: 0.1601563 0.2649793 -0.1079082 debye
dipolederiv: 0.1177904 -0.0183869 0.0125437 0.1208579 -0.3230422 0.1641936 -0.0366677 0.1754537 0.1417986 -0.0541848 0.0025618 -0.0041312 -0.0248686 0.1565194 -0.0652573 0.0155096 0.15989 -0.1321564 -0.0518647 -0.0364903 0.0098614 -0.0282014 0.0053424 -0.0353545 0.0008461 -0.2613666 0.017632 0.3000015 -0.2316835 0.0421618 -0.3828445 0.2248679 -0.0913513 0.090174 -0.1018214 -0.1394164 0.4304222 0.2845079 -0.1373571 0.2578625 -0.0537641 -0.0199798 -0.1279441 -0.0236649 -0.0240342 -0.3529581 0.1054067 -0.0405182 0.0247452 0.0483185 -0.1473786 -0.012329 -0.153728 -0.3711091 -0.6266289 -0.1601256 0.0766826 -0.1038081 -0.3740803 0.0114879 0.0572759 0.016265 -0.3792417 -0.0083818 0.0362364 -0.0872386 0.0788617 0.0874926 0.0415596 -0.0662598 0.039006 0.0118084 -0.0427328 0.0087552 0.1072561 -0.0069733 0.0767467 0.0124253 0.0609739 0.0100371 0.0083091 -0.0691775 -0.0579623 -0.0751943 -0.041797 0.0471836 -0.0255318 -0.0285115 -0.0233425 0.0633308 0.0118675 0.0735202 0.0566848 0.0929721 0.0141684 -0.0670275 0.015142 -0.0602996 0.0670075 0.0616432 -0.0447342 0.0219978 -0.0149235 -0.0736629 0.0779326 0.0121667 0.0806221 0.1468441 -0.0238754 0.0856936 -0.0095325 0.1067987 -0.0057908 0.0519619 -0.0161737 0.05281 0.1742623 0.087921 -0.0365765 0.0179452 -0.0644995 -0.0865543 0.0842789 0.0257712 0.082211 0.1415735 0.2201581 -0.0107224 0.0088384 -0.0141823 0.2562551 0.0080411 0.0100265 0.007928 0.2733916 unknown
polarizability: 99.2548526|7.0711692|63.8174023|-6.9881457|-6.7372564|48.0765384 unknown
InChI: InChI=1S/C7H8/c1-3-7(4-2)5-6-7/h1,4H,2,5-6H2
charge 0 multiplicity 1
15 atoms
C  -0.087373 0.080858 0.002327
C  0.073458 1.114887 -1.160503
C  0.204772 1.591965 0.274333
C  1.012258 -0.922008 0.230298
C  -1.433552 -0.389121 0.281985
C  2.34362 -0.714837 0.061295
C  -2.580943 -0.779491 0.515948
H  -0.830395 1.3794 -1.71549
H  0.977372 1.003192 -1.766084
H  1.199827 1.816287 0.669095
H  -0.609562 2.182405 0.702021
H  0.664532 -1.909136 0.564091
H  3.065163 -1.515273 0.252451
H  2.758658 0.245852 -0.269067
H  -3.577233 -1.124381 0.7217
