program: Gaussian 09
title: 000145596
version: EM64L-G09RevD.01
frameworkgroup: C1[X(C11H14N2O2)]
method: RPBEPBE
basis: SDD
operation: Freq
keyword: #p
keyword: freq=noraman
keyword: PBEPBE/SDD
title: #p freq=noraman PBEPBE/SDD
converged: NO YES NO NO
title: Mulliken charges:
elementType: O O N N C C C C C C C C C C C H H H H H H H H H H H H H H
charge: -0.174459 -0.174457 0.048601 0.018825 -0.258385 -0.258380 -0.093146 -0.089932 0.399769 -0.479901 -0.472553 -0.479897 -0.472568 -0.471197 -0.231270 0.274472 0.274470 0.215921 0.213645 0.213241 0.243809 0.236087 0.206982 0.243814 0.213234 0.206977 0.236100 0.205095 0.205102
chargesum: 0.00000
title: Mulliken charges with hydrogens summed into heavy atoms:
elementType: O O N N C C C C C C C C C C C
charge: -0.174459 -0.174457 0.048601 0.018825 0.016088 0.016090 0.122775 0.123713 0.399769 -0.022851 -0.029483 -0.022850 -0.029491 -0.060999 -0.231270
polarizability: 1.25816573e+02 3.56120954e+00 1.25251554e+02 -8.11267694e-04 -1.08391394e-03 1.16286572e+02
1716.lowfreq: -0.0008 0.0003 0.0005 12.9331 15.5593 38.8260 52.3659 119.5278 120.5497
frequency: 49.9635 119.5130 120.2744 145.8821 194.5546 279.4516 304.2891 325.1015 330.7921 381.4513 386.8855 420.7564 421.5232 438.0558 472.1141 518.7658 538.8399 625.8121 634.0885 656.7897 667.4803 741.4014 767.4278 798.6713 822.3250 839.7769 871.5381 880.0035 883.8129 920.9489 935.2160 960.4681 1000.6657 1006.2871 1040.7507 1040.9744 1054.6429 1073.7011 1100.7041 1103.7153 1106.2193 1113.3257 1116.5587 1157.5560 1203.6223 1220.6746 1230.1084 1247.6796 1270.6121 1287.8113 1296.0899 1306.4988 1311.7132 1325.5811 1328.4370 1339.2513 1348.5795 1349.6678 1357.8002 1368.1320 1419.0741 1456.1592 1461.6297 1471.3703 1480.3124 1491.0639 2184.8347 2968.8960 2983.8276 2985.4443 2989.7840 2993.0165 3009.8178 3015.2806 3026.9199 3041.2142 3044.7299 3047.4042 3049.7213 3049.9945 3052.7182
redmass: 12.5023 6.9789 6.6445 8.1954 5.2278 6.8434 2.4530 2.1676 3.8927 6.1857 2.8456 2.1098 5.1991 1.8962 3.7186 5.9229 5.2888 6.4568 3.7952 5.2737 4.2424 11.7110 3.9404 2.8795 4.2271 2.7986 1.5749 1.5431 2.4444 2.0559 2.1123 2.2401 2.0423 4.2226 2.0033 2.8376 1.8256 1.4593 1.6186 1.4340 2.4825 1.0241 1.0410 1.2354 9.1114 1.0561 1.8958 1.6369 1.9327 1.6493 2.0410 1.9783 1.6635 1.3254 1.3188 1.3947 1.4922 1.6298 1.4399 1.5312 10.9790 1.0869 1.0832 1.0862 1.0939 1.0841 12.6676 1.0609 1.0636 1.0603 1.0664 1.0610 1.0820 1.0826 1.1031 1.1028 1.1026 1.0867 1.1009 1.0876 1.1016
irintensity: 0.2727 1.5664 1.0276 4.0862 2.8056 1.6429 0.1977 0.0059 0.1671 0.0143 0.6761 0.0220 1.5137 0.3811 0.5738 2.0475 0.6121 0.3422 0.5551 0.1594 1.9860 38.1511 0.8954 1.5668 0.7877 1.7768 0.5900 0.0016 1.2621 0.0555 1.7064 8.3480 7.4427 1.9698 4.2988 2.3951 1.2087 0.1468 9.0398 4.9570 15.0115 1.0536 0.2930 1.1749 71.8933 1.3149 0.1559 0.0047 14.1341 0.4204 0.8556 0.1762 1.2380 0.0388 0.1371 0.2700 6.3215 0.7712 1.4346 0.0879 149.3951 7.7041 9.5041 20.1593 12.7592 7.5187 2.8043 32.1292 10.4609 28.5524 3.9826 39.5543 108.8536 68.0485 26.8511 14.3593 39.1008 35.8062 14.3177 1.6639 40.2082
temp: 298.150 k
press: 1.00000 atm
elementType: 8 8 7 7 6 6 6 6 6 6 6 6 6 6 6 1 1 1 1 1 1 1 1 1 1 1 1 1 1
symmnumber: 1
zpe: 624358.2 jmol-1
zpe.correction: 0.237805 hartree
zpe.thermalcorrener: 0.249695 hartree
zpe.thermalcorrenthalpy: 0.250639 hartree
zpe.thermalcorrgfe: 0.200334 hartree
zpe.sumelectzpe: -686.306931 hartree
zpe.sumelectthermal: -686.295041 hartree
zpe.sumelectthermalent: -686.294097 hartree
zpe.sumelectthermalfe: -686.344402 hartree
dipole: -5.6098 -1.0161 0.0000
dipole: 5.7011
quadrupole: -98.3124 -96.7894 -86.7870
quadrupole: -1.7664 0.0003 0.0003
quadrupole: -4.3495 -2.8265 7.1760 -1.7664 0.0003 0.0003
hfenergy: -686.5447363 hartree
pointgroup: C01 [X(C11H14N2O2)]
dipole: 2.2370567 -0.1629066 -0.0018707 debye
polarizability: 126.5628848|-3.4210272|124.505211|-0.0130934|0.0145187|116.2866029 unknown
InChI: InChI=1S/C11H14N2O2/c12-6-11(13(14)15)9-2-7-1-8(4-9)5-10(11)3-7/h7-10H,1-5H2
charge 0 multiplicity 1
29 atoms
O  -2.262441 -1.438985 -1.137337
O  -2.260922 -1.441819 1.137077
N  -1.85552 -1.015286 0.000131
N  -2.251385 2.386651 0.004952
C  0.120565 0.06549 1.282107
C  0.118686 0.068918 -1.281903
C  2.005165 1.203828 0.000259
C  1.821158 -1.325923 -0.002952
C  -0.768399 0.168322 0.000886
C  1.110128 1.268463 1.267439
C  0.924584 -1.263294 1.261944
C  1.108314 1.271821 -1.265471
C  0.922759 -1.259895 -1.266402
C  2.807583 -0.12569 -0.00206
C  -1.59556 1.39033 0.003105
H  -0.52922 0.109327 2.17289
H  -0.532378 0.115089 -2.171631
H  2.701499 2.064085 0.000891
H  2.387303 -2.276926 -0.004647
H  1.733118 1.21587 2.180729
H  0.559551 2.228046 1.305216
H  0.245416 -2.134971 1.304957
H  1.549482 -1.300808 2.174827
H  0.557738 2.231527 -1.299975
H  1.730008 1.221557 -2.179773
H  1.546384 -1.294969 -2.180253
H  0.24356 -2.13148 -1.310799
H  3.463709 -0.171317 -0.893863
H  3.465014 -0.173662 0.888657
