program: Gaussian 09
title: 000145643
version: EM64L-G09RevD.01
frameworkgroup: C1[X(C12H16N2)]
method: RPBEPBE
basis: SDD
operation: Freq
keyword: #pfreq=noraman
keyword: PBEPBE/SDD
title: #p freq=noraman PBEPBE/SDD
converged: YES YES NO NO
title: Mulliken charges:
elementType: N N C C C C C C C C C C C C H H H H H H H H H H H H H H H H
charge: -0.240003 -0.239833 0.277618 0.265718 0.266116 0.195439 -0.672100 -0.672383 -0.390695 -0.390905 -0.804417 -0.803951 -0.242353 -0.242273 0.230137 0.231647 0.260494 0.231686 0.230128 0.260187 0.230225 0.230077 0.213629 0.246190 0.217122 0.245818 0.213418 0.217028 0.218121 0.218117
chargesum: 0.00000
title: Mulliken charges with hydrogens summed into heavy atoms:
elementType: N N C C C C C C C C C C C C
charge: -0.240003 -0.239833 0.277618 0.265718 0.266116 0.195439 0.050177 0.049618 -0.160471 -0.160829 -0.127476 -0.127687 -0.024232 -0.024155
polarizability: 2.42147030e+02 1.61367562e-02 1.48222464e+02 7.36888759e-01 -8.32360562e-03 7.60496148e+01
1716.lowfreq: -9.3291 -0.0005 0.0006 0.0006 4.2096 6.5112 13.2653 63.9074 106.5153
frequency: 5.3646 63.8971 106.5130 113.8203 126.5636 132.2147 215.6538 221.4010 226.5316 264.5728 272.9161 324.4748 327.0350 339.7861 357.7297 387.1846 443.5438 507.8020 544.9731 558.8363 567.9477 630.9173 634.6452 656.0175 730.9048 740.7534 798.8749 819.9318 824.9375 887.8437 944.9728 946.4939 966.6271 987.4840 1002.7240 1018.7495 1062.3173 1076.2658 1109.7324 1112.7745 1115.1564 1125.6433 1147.0607 1171.9277 1224.3363 1230.1695 1263.4814 1308.3964 1339.4140 1354.2609 1392.4449 1407.2774 1431.6257 1440.4005 1444.4998 1455.2937 1459.3165 1464.5920 1477.2655 1487.3866 1489.4722 1491.6623 1503.2291 1508.5530 1515.2927 1613.4441 1617.7793 1678.1051 2935.0701 2938.7760 2964.3338 2965.3062 3014.3736 3015.7483 3036.4636 3037.5604 3090.7778 3094.4888 3110.3834 3112.9446 3128.4469 3140.6431 3152.2691 3166.8492
redmass: 2.5942 2.9298 1.1928 3.8243 3.1810 1.1018 1.3249 2.4898 1.3462 2.5081 5.0503 2.2847 2.5684 3.7733 2.4499 2.6841 3.2595 3.5612 4.1416 5.5059 3.9890 7.7486 4.1948 4.9837 1.2307 4.2195 4.0440 3.7935 1.5356 1.3890 2.0065 1.2835 1.3312 2.0400 2.0246 2.0656 1.4739 2.5047 1.5380 1.3303 1.3823 1.4066 2.0471 1.1648 2.8499 2.8303 4.1569 1.6681 3.8031 5.6825 1.2349 1.2300 3.7624 1.2130 1.4857 1.6719 1.1302 1.0665 1.0552 1.0699 1.0564 1.0683 1.0568 1.2395 2.6181 7.4532 7.6053 7.4021 1.0475 1.0485 1.0378 1.0380 1.0895 1.0877 1.1003 1.1002 1.0933 1.0937 1.0962 1.0961 1.0845 1.0894 1.0944 1.1001
irintensity: 0.9878 1.5684 0.0005 7.7622 0.5096 0.0112 0.0470 0.4229 0.0415 1.8728 2.5020 0.2121 5.3409 3.9548 0.0630 1.1772 7.1565 0.8799 7.8866 9.1761 0.3583 0.5517 0.0224 1.0999 121.6545 0.3670 9.0609 0.4469 0.0004 5.3529 0.7888 0.0029 0.2177 0.0316 10.0524 33.4015 23.6652 1.9013 55.1888 12.8971 8.3711 9.3478 19.2318 3.1535 34.1388 0.4309 83.1028 1.4446 99.4968 79.4617 1.5267 6.6610 25.2116 14.8011 6.4372 14.3518 0.4041 34.5105 5.5030 18.0249 3.2403 25.0314 7.0792 32.3265 153.4434 25.0303 35.0086 309.1469 51.7695 178.5799 147.2970 13.6293 9.1426 62.5922 19.1334 66.6379 30.3775 34.2820 7.0047 9.0801 0.0424 19.7814 34.1270 19.1361
temp: 298.150 k
press: 1.00000 atm
elementType: 7 7 6 6 6 6 6 6 6 6 6 6 6 6 1 1 1 1 1 1 1 1 1 1 1 1 1 1 1 1
symmnumber: 1
zpe: 664667.0 jmol-1
zpe.correction: 0.253158 hartree
zpe.thermalcorrener: 0.267388 hartree
zpe.thermalcorrenthalpy: 0.268332 hartree
zpe.thermalcorrgfe: 0.210794 hartree
zpe.sumelectzpe: -575.312793 hartree
zpe.sumelectthermal: -575.298563 hartree
zpe.sumelectthermalent: -575.297619 hartree
zpe.sumelectthermalfe: -575.355158 hartree
dipole: 1.4383 0.0008 1.0317
dipole: 1.7700
quadrupole: -83.8087 -71.6695 -89.4585
quadrupole: -0.0052 0.6151 -0.0009
quadrupole: -2.1631 9.9760 -7.8129 -0.0052 0.6151 -0.0009
hfenergy: -575.5659517 hartree
pointgroup: C01 [X(C12H16N2)]
dipole: -0.5750797 0.0068686 -0.3926695 debye
polarizability: 242.0907863|0.4810853|148.1852127|-3.0858347|1.6773045|76.1431098 unknown
InChI: InChI=1S/C12H16N2/c1-9(2)12-13(3)10-7-5-6-8-11(10)14(12)4/h5-8H,1-4H3
charge 0 multiplicity 1
30 atoms
N  -0.36666 -1.137263 -0.073129
N  -0.376915 1.139948 -0.020517
C  -1.256951 -0.004093 0.017859
C  0.970849 -0.706891 0.018951
C  0.964461 0.717798 0.052254
C  -2.623902 -0.01503 0.208663
C  -0.692786 -2.489542 -0.5315
C  -0.715979 2.509044 -0.414494
C  2.174826 -1.430568 0.03161
C  2.161995 1.450683 0.099637
C  -3.451183 1.253956 0.382153
C  -3.438328 -1.299097 0.323391
C  3.390777 -0.691244 0.08261
C  3.384467 0.720606 0.116076
H  -0.83189 -3.203923 0.302775
H  0.136528 -2.858045 -1.164416
H  -1.606075 -2.476643 -1.144178
H  0.113459 2.91751 -1.022013
H  -0.869664 3.180553 0.452112
H  -1.624332 2.515328 -1.035088
H  2.187756 -2.525069 0.01461
H  2.165487 2.544849 0.134214
H  -4.270387 1.055571 1.100134
H  -2.874516 2.09937 0.789261
H  -3.939221 1.596194 -0.555715
H  -2.854958 -2.153115 0.702767
H  -4.266364 -1.138186 1.04046
H  -3.913613 -1.610069 -0.631696
H  4.34395 -1.230644 0.103868
H  4.332771 1.266913 0.163141
