program: Gaussian 09
title: 000145577
version: EM64L-G09RevD.01
frameworkgroup: C1[X(C12H11N4)]
method: RPBEPBE
basis: SDD
operation: Freq
keyword: #p
keyword: freq=noraman
keyword: PBEPBE/SDD
title: #p freq=noraman PBEPBE/SDD
converged: NO YES NO NO
title: Mulliken charges:
elementType: N N N N C C C C C C C C C C C C H H H H H H H H H H H
charge: -0.223388 -0.069521 -0.046718 -0.055882 -0.417591 0.369907 -0.020522 -0.310774 -0.086836 -0.115193 -0.257653 -0.183241 -0.203615 -0.175873 -0.171172 -0.125755 0.325454 0.249685 0.238401 0.335958 0.284692 0.280048 0.251613 0.259866 0.288500 0.284813 0.294797
chargesum: 1.00000
title: Mulliken charges with hydrogens summed into heavy atoms:
elementType: N N N N C C C C C C C C C C C C
charge: -0.223388 -0.069521 -0.046718 -0.055882 0.157549 0.369907 -0.020522 -0.072373 0.249122 0.169499 0.022395 0.068371 0.056251 0.112627 0.113641 0.169042
polarizability: 1.91817954e+02 1.98086392e+00 1.52899389e+02 -8.41942593e+00 9.97531223e+00 9.69725233e+01
1716.lowfreq: -6.1206 0.0005 0.0007 0.0008 4.8446 9.2231 30.1494 31.8231 62.2571
frequency: 30.1467 31.7995 62.2380 137.6354 178.8771 222.5415 235.7045 320.5522 325.6353 395.7563 423.7852 439.3104 453.1537 522.2266 550.1996 573.7708 611.0709 637.6376 640.7602 688.0144 719.5516 748.2057 753.1445 757.3006 769.2201 784.9236 826.0909 862.1717 872.7172 889.2841 960.3147 962.0968 999.2636 1001.2532 1006.0722 1009.0447 1027.8813 1038.5012 1049.9450 1087.6390 1092.1007 1115.8600 1133.4487 1171.2381 1186.6460 1212.5501 1221.5463 1243.3502 1283.5832 1298.7663 1351.5521 1359.6418 1381.7592 1395.9342 1412.2943 1439.6269 1443.6890 1476.0619 1477.2208 1484.4907 1570.1011 1589.1827 1619.5756 1623.8404 3047.8787 3119.5818 3144.6477 3150.9411 3161.3528 3174.6765 3177.3194 3186.0182 3190.9611 3198.0571 3205.4680
redmass: 4.2131 5.2674 4.8027 4.8900 4.6876 6.0002 4.4484 7.1400 2.5875 2.7150 2.9739 3.0807 5.0342 6.7177 4.3352 5.4114 5.9268 7.1467 6.3420 2.4706 3.6483 3.4145 3.2622 4.8144 1.4181 2.2471 4.1006 1.3963 1.2565 8.1486 1.3675 1.3480 1.4562 1.3350 2.2256 4.1292 1.3713 2.0962 2.6846 4.4248 3.0806 1.7518 1.7991 1.3947 1.0703 2.1055 1.2341 1.8602 1.9852 1.9703 1.6021 1.5791 1.8216 3.5634 2.6250 3.6902 1.2072 2.3131 2.5289 1.9973 5.8455 7.1274 7.1424 5.1342 1.0589 1.1091 1.0886 1.0969 1.0917 1.0949 1.0909 1.0932 1.0996 1.0976 1.1027
irintensity: 0.8951 0.6303 2.4104 4.7217 3.5170 0.3142 1.8223 0.2126 1.8860 0.6534 6.2965 6.8220 2.6742 1.6444 10.7801 7.3571 4.2434 1.5504 0.2248 46.0328 27.7573 2.9386 36.7730 9.2221 107.8920 141.8593 49.3821 1.2308 1.8225 32.3980 1.5311 2.2921 1.8838 0.0133 13.2476 10.9245 0.3028 17.8788 0.9595 59.7098 109.4604 2.1377 16.8445 20.1894 2.7350 1.0652 17.0692 28.0611 15.1449 7.0052 37.3219 3.3187 11.4402 25.6952 5.5256 32.5598 25.6525 25.6335 47.1747 63.2931 2.9958 13.1205 37.2564 18.1004 10.8287 0.9332 2.6896 35.8401 6.6599 3.5293 0.1470 1.2098 2.6737 3.0169 0.3199
temp: 298.150 k
press: 1.00000 atm
elementType: 7 7 7 7 6 6 6 6 6 6 6 6 6 6 6 6 1 1 1 1 1 1 1 1 1 1 1
symmnumber: 1
zpe: 555942.9 jmol-1
zpe.correction: 0.211747 hartree
zpe.thermalcorrener: 0.223890 hartree
zpe.thermalcorrenthalpy: 0.224834 hartree
zpe.thermalcorrgfe: 0.171562 hartree
zpe.sumelectzpe: -681.492705 hartree
zpe.sumelectthermal: -681.480562 hartree
zpe.sumelectthermalent: -681.479618 hartree
zpe.sumelectthermalfe: -681.532890 hartree
dipole: -8.6449 4.8113 0.2540
dipole: 9.8969
quadrupole: -32.8826 -81.8681 -80.7841
quadrupole: 2.4121 1.4351 4.9279
quadrupole: 32.2956 -16.6898 -15.6058 2.4121 1.4351 4.9279
hfenergy: -681.7044521 hartree
pointgroup: C01 [X(C12H11N4)]
dipole: -3.334129 -1.9671211 -0.4186073 debye
polarizability: 191.8646323|-1.9537069|148.3296875|8.1186847|18.3045946|101.495546 unknown
InChI: InChI=1S/C12H11N4/c1-4-8-15(9-5-1)10-16-12-7-3-2-6-11(12)13-14-16/h1-9H,10H2
charge 1 multiplicity 1
27 atoms
N  0.383726 0.649852 -0.812264
N  -1.971819 -0.039978 -0.638461
N  0.522714 2.016536 -0.30279
N  1.656201 2.070621 0.367485
C  -0.792194 0.336806 -1.55458
C  1.481946 -0.11319 -0.411184
C  2.29159 0.807181 0.332576
C  1.875352 -1.453537 -0.614192
C  -2.346628 0.860577 0.333074
C  -2.636057 -1.229658 -0.811729
C  3.526059 0.408266 0.896085
C  3.106692 -1.838077 -0.045615
C  3.919453 -0.926541 0.69738
C  -3.431079 0.571677 1.173533
C  -3.724758 -1.55654 0.009901
C  -4.131765 -0.647774 1.015451
H  -1.109726 1.229074 -2.119093
H  -0.628657 -0.50546 -2.244804
H  1.276516 -2.169419 -1.1861
H  -1.750375 1.776963 0.400171
H  -2.280449 -1.889841 -1.606271
H  4.138853 1.119752 1.455749
H  3.455396 -2.867296 -0.179307
H  4.867393 -1.280054 1.113293
H  -3.717502 1.298616 1.936969
H  -4.239257 -2.508473 -0.139794
H  -4.979721 -0.885981 1.66392
