program: Gaussian 09
title: 000016305
version: EM64L-G09RevD.01
frameworkgroup: C1[X(C12H8Br2O)]
method: RPBEPBE
basis: SDD
operation: Freq
keyword: #p
keyword: freq=noraman
keyword: PBEPBE/SDD
title: #p freq=noraman PBEPBE/SDD
converged: NO YES NO NO
title: Mulliken charges:
elementType: Br Br O C C C C C C C C C C C C H H H H H H H H
charge: 0.013750 0.013520 -0.301521 0.343830 0.343708 -0.347747 -0.347492 -0.370758 -0.370745 -0.154675 -0.154815 -0.146556 -0.146578 -0.234827 -0.234843 0.274114 0.273983 0.265903 0.265824 0.253193 0.253114 0.254829 0.254791
chargesum: 0.00000
title: Mulliken charges with hydrogens summed into heavy atoms:
elementType: Br Br O C C C C C C C C C C C C
charge: 0.013750 0.013520 -0.301521 0.343830 0.343708 -0.073633 -0.073509 -0.104855 -0.104922 0.098518 0.098299 0.108274 0.108212 -0.234827 -0.234843
polarizability: 2.93575092e+02 -1.06820668e-01 1.32817278e+02 -1.46588087e+01 -9.80127214e-02 8.31790046e+01
1716.lowfreq: -10.7409 -3.4776 -0.0006 -0.0004 0.0005 1.3877 18.2323 30.2313 54.1376
frequency: 17.9141 30.2305 54.1371 102.9640 110.7502 168.9226 193.6316 241.3981 279.3928 301.6013 308.8894 378.9359 408.8513 410.2551 414.5840 486.9490 490.9730 597.7060 607.8238 630.1792 637.5983 692.1877 703.0843 752.1135 810.4166 821.0897 823.9293 835.8464 849.1307 942.2555 948.6194 958.2554 964.0553 989.6037 992.2716 1055.1601 1056.4052 1103.3752 1106.3107 1150.5129 1170.7045 1185.5653 1220.8590 1282.9796 1287.5143 1355.4877 1372.4660 1394.1239 1397.9939 1459.1642 1465.2100 1578.4055 1585.4594 1587.0153 1604.1905 3155.7517 3157.8289 3163.0123 3163.1966 3175.8252 3176.6806 3182.4289 3182.7049
redmass: 5.0624 13.0946 4.1697 8.8545 7.9092 14.3850 8.6013 7.0513 10.0291 7.4287 5.8072 5.6705 5.8935 2.9486 3.0690 3.2828 2.8738 5.7234 7.5653 7.6199 6.9563 3.8274 3.9609 5.5400 1.2986 1.2491 1.4762 1.6143 5.8037 1.3286 1.3277 1.3572 1.3444 4.7090 4.6947 2.3976 2.5790 1.3243 1.3063 2.2141 1.1692 1.4213 4.5327 1.2479 1.2480 5.6731 7.2769 3.8940 3.4964 2.2810 2.3827 7.2829 7.3149 6.7876 7.0605 1.0888 1.0883 1.0887 1.0888 1.0969 1.0969 1.0977 1.0978
irintensity: 0.7500 0.0226 0.1237 1.1288 0.0186 0.0926 2.5654 0.0242 4.7280 6.9244 0.0744 4.5815 0.5716 1.0118 0.3734 22.9313 52.8300 0.1604 22.7145 23.9754 1.8584 4.3188 0.1402 3.0746 17.8000 0.2914 96.9359 35.0905 10.8879 0.1927 0.2898 0.6584 0.0148 142.9775 9.1651 78.4605 8.6221 8.8615 12.2785 6.2299 58.2434 0.3281 547.9139 1.4502 0.8058 0.9383 0.0526 3.3681 2.5721 506.5782 34.5423 7.9978 0.3010 45.3492 0.8169 9.9501 0.9052 4.9410 0.8667 3.6739 3.4210 0.6789 1.9138
temp: 298.150 k
press: 1.00000 atm
elementType: 35 35 8 6 6 6 6 6 6 6 6 6 6 6 6 1 1 1 1 1 1 1 1
symmnumber: 1
zpe: 423076.6 jmol-1
zpe.correction: 0.161141 hartree
zpe.thermalcorrener: 0.174460 hartree
zpe.thermalcorrenthalpy: 0.175404 hartree
zpe.thermalcorrgfe: 0.117050 hartree
zpe.sumelectzpe: -563.163503 hartree
zpe.sumelectthermal: -563.150184 hartree
zpe.sumelectthermalent: -563.149240 hartree
zpe.sumelectthermalfe: -563.207595 hartree
dipole: 0.0130 0.4287 0.0008
dipole: 0.4289
quadrupole: -119.2645 -100.6481 -104.9898
quadrupole: -0.0386 -4.1876 -0.0423
quadrupole: -10.9637 7.6527 3.3110 -0.0386 -4.1876 -0.0423
hfenergy: -563.3246447 hartree
pointgroup: C01 [X(C12H8Br2O1)]
dipole: 0.0051142 -0.1686615 -0.0009383 debye
dipolederiv: -0.6963612 -0.2195922 0.0050396 -0.2959097 -0.1569035 0.0191072 -0.0014337 0.0149432 -0.0419937 -0.6968799 0.2195075 0.0073159 0.2955051 -0.1570152 -0.0201116 0.0016285 -0.0159555 -0.0421632 -2.644906 0.0013954 0.0108962 0.0034598 -0.3898631 -0.0008294 -0.4297561 -0.0008598 -0.2044047 1.817393 0.2257235 -0.0208228 0.8476671 0.1692406 -0.0515617 0.2387682 -0.0281838 0.110735 1.8218278 -0.2276364 -0.0239343 -0.8503974 0.1699614 0.0518661 0.2309679 0.0287008 0.1108919 -0.2893649 -0.0000429 0.028107 -0.2858283 -0.1017205 -0.041222 0.0881122 -0.0387791 -0.1146855 -0.2898283 0.000299 0.0275208 0.2876307 -0.1022732 0.0410725 0.090171 0.0386081 -0.1155682 -0.3732878 -0.0182525 0.039891 0.0330264 0.0035614 -0.0722863 -0.0098442 -0.0820145 -0.109019 -0.3752985 0.019726 0.0403933 -0.0332229 0.0036213 0.072861 -0.0096455 0.0823574 -0.1096271 -0.2053536 -0.0804573 0.0216298 -0.0960116 -0.0001821 -0.0737537 0.0345531 -0.0668768 -0.027691 -0.2039738 0.0811886 0.0230694 0.0957637 -0.0000294 0.073191 0.0355479 0.0664703 -0.0278678 -0.1967607 -0.1303509 0.0551478 -0.1116219 -0.0442796 -0.0547504 0.0458311 -0.0585133 -0.0368749 -0.195381 0.1298706 0.0552525 0.1102931 -0.043129 0.054735 0.0451724 0.058229 -0.0372614 1.082967 0.4758861 -0.0070165 0.5463188 0.1282013 -0.037734 -0.007224 -0.0331543 -0.1308712 1.0825218 -0.4756434 -0.0122233 -0.5445711 0.127261 0.0394335 -0.0123896 0.0349405 -0.1313181 0.0106713 0.0259092 -0.0688722 0.048425 0.0768309 0.0423992 -0.1192883 0.0395646 0.1135466 0.0100844 -0.0263346 -0.0682244 -0.0492302 0.0766265 -0.0423788 -0.1188389 -0.039424 0.1140729 0.0951521 -0.0544074 0.0025051 -0.0478869 0.0196182 0.0827992 0.0020703 0.0802632 0.1199187 0.0949191 0.0540259 0.0027657 0.0473145 0.0192778 -0.0830127 0.0022549 -0.0804954 0.1200756 0.0783177 -0.0248066 0.0044816 -0.037476 0.0114804 0.0882302 0.0160187 0.0827281 0.106367 0.0784771 0.0243927 0.0044815 0.0370626 0.0112372 -0.088247 0.0158852 -0.0827693 0.1064418 -0.0022573 0.049122 -0.0639156 0.0379005 0.0893156 0.0534038 -0.0696592 0.0516573 0.1133106 -0.0026783 -0.0495222 -0.063488 -0.0382113 0.089162 -0.0532111 -0.0689019 -0.0514367 0.1139856 unknown
polarizability: 293.8295259|0.0740731|132.8173838|12.6999667|0.0716563|82.9244649 unknown
InChI: InChI=1S/C12H8Br2O/c13-9-1-5-11(6-2-9)15-12-7-3-10(14)4-8-12/h1-8H
charge 0 multiplicity 1
23 atoms
Br 5.572718 1.279897 -0.090336
Br -5.571355 1.279217 0.103842
O  0.000525 -1.38271 -0.006599
C  1.235176 -0.686356 -0.006416
C  -1.23364 -0.68641 0.000074
C  1.436029 0.528308 -0.702619
C  -1.431361 0.529061 0.695871
C  2.305082 -1.330888 0.651003
C  -2.306879 -1.331555 -0.6514
C  2.722777 1.10982 -0.725042
C  -2.718095 1.110296 0.724192
C  3.592776 -0.75303 0.62491
C  -3.594448 -0.75394 -0.619505
C  3.786254 0.465427 -0.059152
C  -3.78481 0.465113 0.064373
H  0.610215 1.011725 -1.232831
H  -0.60303 1.013419 1.221282
H  2.121901 -2.274902 1.171555
H  -2.126102 -2.276021 -1.172014
H  2.889873 2.046721 -1.263531
H  -2.882547 2.047754 1.262527
H  4.426525 -1.24512 1.132983
H  -4.430582 -1.246725 -1.122969
