program: Gaussian 09
title: 000145838
version: EM64L-G09RevD.01
frameworkgroup: C1[X(C11H8Cl2N2O4)]
method: RPBEPBE
basis: SDD
operation: Freq
keyword: #p
keyword: freq=noraman
keyword: PBEPBE/SDD
title: #p freq=noraman PBEPBE/SDD
converged: YES YES NO NO
title: Mulliken charges:
elementType: Cl Cl O O O O N N C C C C C C C C C C C H H H H H H H H
charge: 0.020245 0.053595 -0.186675 -0.189057 -0.202985 -0.199081 -0.411427 0.027646 0.353210 0.013970 -0.312435 -0.331393 0.380735 0.451667 -0.359824 -0.363430 0.348158 -0.693814 -0.724139 0.255948 0.281599 0.289468 0.290969 0.324234 0.240448 0.275253 0.367116
chargesum: 0.00000
title: Mulliken charges with hydrogens summed into heavy atoms:
elementType: Cl Cl O O O O N N C C C C C C C C C C C
charge: 0.020245 0.053595 -0.186675 -0.189057 -0.202985 -0.199081 -0.087193 0.027646 0.353210 0.013970 -0.056487 -0.049794 0.380735 0.451667 -0.070357 -0.072461 0.348158 -0.178113 -0.357023
polarizability: 2.17577295e+02 -3.71762500e+01 1.78338439e+02 2.82951824e+01 8.48873362e+00 1.29082119e+02
1716.lowfreq: -4.9099 0.0003 0.0014 0.0021 4.0814 6.8624 19.0887 24.6710 36.7059
frequency: 19.0411 24.6019 36.6782 57.9660 66.0378 78.6793 104.5182 114.4423 124.3236 138.9578 188.0080 222.2737 233.0443 253.0621 271.9205 310.5968 341.9899 377.5793 386.5505 406.9210 451.2341 486.3534 507.0587 540.4221 566.5894 604.5441 622.5997 636.8049 663.7521 679.7706 702.0298 707.7956 718.0873 744.8662 754.8907 774.4551 792.5204 851.6286 878.5804 911.5936 949.1433 970.5844 988.2631 1002.5913 1009.6677 1013.1048 1090.6006 1112.5368 1181.7497 1187.0714 1188.1673 1210.9739 1221.2136 1234.6964 1297.1124 1328.8815 1366.4763 1403.7909 1404.9196 1412.3500 1475.2436 1493.7864 1562.5326 1595.1564 1607.4997 1614.5708 1636.1114 3114.7034 3157.6842 3166.4235 3167.5350 3186.4805 3189.6093 3235.8130 3482.2625
redmass: 19.7179 13.8232 7.6872 8.9206 9.0547 5.1932 7.5416 7.8290 7.9091 11.2533 9.3391 8.1344 11.5447 10.1617 7.6522 4.5008 6.0724 5.6468 12.6600 2.8864 4.5906 7.3185 6.5919 4.0485 6.2172 5.5695 6.3832 1.3245 4.6987 5.1274 4.3124 3.2450 4.9254 2.8021 2.6535 4.2361 8.6227 1.2693 1.7262 2.8088 1.5483 4.7414 1.3586 1.6102 2.3161 2.4274 3.2344 1.3018 1.3027 1.1205 2.1363 2.9549 2.7649 2.1221 1.2738 4.5723 7.7310 8.0852 1.3717 3.8570 2.3857 1.6564 11.2142 8.0029 6.5947 8.1340 5.2361 1.0637 1.0895 1.0897 1.0897 1.0952 1.0968 1.1142 1.0770
irintensity: 0.1852 0.0201 0.2328 2.0930 1.0510 2.4449 7.6851 6.3620 0.9776 3.9851 4.2896 1.3207 1.1011 4.2002 0.6324 10.6213 3.9700 12.0699 5.2871 0.7352 9.6596 9.4322 0.9966 6.6532 10.9339 67.9424 2.6840 60.7888 14.7387 8.6837 46.1306 51.4507 35.9309 65.3607 4.0411 22.0067 30.0394 2.8360 42.4256 15.1492 55.4740 58.2946 2.5299 3.8377 4.1963 10.8048 12.0550 15.1379 27.1166 19.2072 25.8193 267.6638 101.7072 19.6493 0.4718 138.4864 85.2125 13.8061 70.5908 73.7931 7.0716 109.3822 139.3583 12.8143 24.8527 153.8318 32.6957 5.5333 5.4114 0.4598 1.0753 1.0348 2.1015 2.2436 37.6159
temp: 298.150 k
press: 1.00000 atm
elementType: 17 17 8 8 8 8 7 7 6 6 6 6 6 6 6 6 6 6 6 1 1 1 1 1 1 1 1
symmnumber: 1
zpe: 464223.3 jmol-1
zpe.correction: 0.176813 hartree
zpe.thermalcorrener: 0.194874 hartree
zpe.thermalcorrenthalpy: 0.195818 hartree
zpe.thermalcorrgfe: 0.127165 hartree
zpe.sumelectzpe: -1753.023495 hartree
zpe.sumelectthermal: -1753.005435 hartree
zpe.sumelectthermalent: -1753.004491 hartree
zpe.sumelectthermalfe: -1753.073144 hartree
dipole: -5.5123 0.9290 -2.6553
dipole: 6.1886
quadrupole: -137.9553 -134.9166 -118.8965
quadrupole: 8.5600 6.6915 -7.9709
quadrupole: -7.3658 -4.3271 11.6929 8.5600 6.6915 -7.9709
hfenergy: -1753.2003087 hartree
pointgroup: C01 [X(C11H8Cl2N2O4)]
dipole: -1.9032821 -0.485613 1.4387119 debye
polarizability: 201.9114474|41.4547177|178.4831601|-40.7863289|2.9634864|144.6032462 unknown
InChI: InChI=1S/C11H8Cl2N2O4/c1-6(14-11(17)10(12)13)9(16)7-2-4-8(5-3-7)15(18)19/h2-5,10,14H,1H2
charge 0 multiplicity 1
27 atoms
Cl -4.608713 1.635697 1.113627
Cl -1.788102 2.843343 0.914879
O  -0.615102 -3.260725 -0.470353
O  -1.928341 0.009632 -1.226468
O  4.09126 2.290409 0.486736
O  4.58869 1.316494 -1.515234
N  -2.369592 -0.500025 1.019827
N  3.86444 1.43565 -0.45393
C  0.482912 -1.16329 -0.026307
C  -0.655622 -2.136388 0.103287
C  0.782328 -0.212488 0.984398
C  1.31593 -1.261031 -1.172786
C  2.694006 0.530437 -0.304743
C  -1.81941 -1.814821 1.027638
C  1.894435 0.64027 0.852492
C  2.423251 -0.41069 -1.324069
C  -2.40237 0.316146 -0.096625
C  -2.276244 -2.769387 1.88363
C  -3.02615 1.702603 0.099367
H  0.161148 -0.147724 1.882751
H  1.071706 -2.008113 -1.933606
H  2.15192 1.378013 1.616395
H  3.073479 -0.456535 -2.201182
H  -2.926903 -0.206291 1.829803
H  -3.110017 -2.59407 2.572674
H  -1.808112 -3.756069 1.885876
H  -3.282228 2.148353 -0.867779
